BDBM84784 (6a) BIRB796::(8a) BIRB796
SMILES: Cc1cc(ccc1C(O)=O)C(=O)NCc1ccc(cc1)-n1nc(cc1NC(=O)Nc1cccc2ccccc12)C(C)(C)C
InChI Key: InChIKey=OGIXSWYOHHAZGM-UHFFFAOYSA-N
Data: 4 IC50
Activity Spreadsheet -- Enzyme Inhibition Constant Data from BindingDB
Found 4 hits for monomerid = 84784
Trg + Lig
Ki
nM
ΔG°
kcal/mole
IC50
nM
Kd
nM
EC50/IC50
nM
koff
s-1
kon
M-1s-1
pHTemp
°C
Mitogen-activated protein kinase 14
(Homo sapiens (Human))
BDBM84784
((6a) BIRB796 | (8a) BIRB796)
Show SMILES Cc1cc(ccc1C(O)=O)C(=O)NCc1ccc(cc1)-n1nc(cc1NC(=O)Nc1cccc2ccccc12)C(C)(C)C
Show InChI InChI=1S/C34H33N5O4/c1-21-18-24(14-17-26(21)32(41)42)31(40)35-20-22-12-15-25(16-13-22)39-30(19-29(38-39)34(2,3)4)37-33(43)36-28-11-7-9-23-8-5-6-10-27(23)28/h5-19H,20H2,1-4H3,(H,35,40)(H,41,42)(H2,36,37,43)
NCI pathway
Reactome pathway
n/an/a 393n/an/an/an/a7.525
Pfizer Inc.
Assay Description
Inhibition of active p38a MAP kinase by inhibitors was determinedusing a p38a cascade activity assay. A 30-lL reaction mixture wasprepared containing...
Chem Biol Drug Des 74: 547-59 (2009)
Article DOI: 10.1111/j.1747-0285.2009.00884.x
BindingDB Entry DOI: 10.7270/Q2930RPH
Mitogen-activated protein kinase 14
(Homo sapiens (Human))
BDBM84784
((6a) BIRB796 | (8a) BIRB796)
Show SMILES Cc1cc(ccc1C(O)=O)C(=O)NCc1ccc(cc1)-n1nc(cc1NC(=O)Nc1cccc2ccccc12)C(C)(C)C
Show InChI InChI=1S/C34H33N5O4/c1-21-18-24(14-17-26(21)32(41)42)31(40)35-20-22-12-15-25(16-13-22)39-30(19-29(38-39)34(2,3)4)37-33(43)36-28-11-7-9-23-8-5-6-10-27(23)28/h5-19H,20H2,1-4H3,(H,35,40)(H,41,42)(H2,36,37,43)
NCI pathway
Reactome pathway
n/an/a 25n/an/an/an/a7.525
Pfizer Inc.
Assay Description
Binding of inhibitors to unactivated p38a that leads to decreasedphosphorylation of p38alpha by MKK6 was determined by measuringthe activated p38alph...
Chem Biol Drug Des 74: 547-59 (2009)
Article DOI: 10.1111/j.1747-0285.2009.00884.x
BindingDB Entry DOI: 10.7270/Q2930RPH
Mitogen-activated protein kinase 14
(Homo sapiens (Human))
BDBM84784
((6a) BIRB796 | (8a) BIRB796)
Show SMILES Cc1cc(ccc1C(O)=O)C(=O)NCc1ccc(cc1)-n1nc(cc1NC(=O)Nc1cccc2ccccc12)C(C)(C)C
Show InChI InChI=1S/C34H33N5O4/c1-21-18-24(14-17-26(21)32(41)42)31(40)35-20-22-12-15-25(16-13-22)39-30(19-29(38-39)34(2,3)4)37-33(43)36-28-11-7-9-23-8-5-6-10-27(23)28/h5-19H,20H2,1-4H3,(H,35,40)(H,41,42)(H2,36,37,43)
NCI pathway
Reactome pathway
n/an/a 11n/an/an/an/a7.525
Pfizer Inc.
Assay Description
Binding of inhibitors to unactivated p38a that leads to decreasedphosphorylation of p38alpha by MKK6 was determined by measuringthe activated p38alph...
Chem Biol Drug Des 74: 547-59 (2009)
Article DOI: 10.1111/j.1747-0285.2009.00884.x
BindingDB Entry DOI: 10.7270/Q2930RPH
Mitogen-activated protein kinase 14
(Homo sapiens (Human))
BDBM84784
((6a) BIRB796 | (8a) BIRB796)
Show SMILES Cc1cc(ccc1C(O)=O)C(=O)NCc1ccc(cc1)-n1nc(cc1NC(=O)Nc1cccc2ccccc12)C(C)(C)C
Show InChI InChI=1S/C34H33N5O4/c1-21-18-24(14-17-26(21)32(41)42)31(40)35-20-22-12-15-25(16-13-22)39-30(19-29(38-39)34(2,3)4)37-33(43)36-28-11-7-9-23-8-5-6-10-27(23)28/h5-19H,20H2,1-4H3,(H,35,40)(H,41,42)(H2,36,37,43)
NCI pathway
Reactome pathway
n/an/a 664n/an/an/an/a7.525
Pfizer Inc.
Assay Description
Inhibition of active p38a MAP kinase by inhibitors was determinedusing a p38a cascade activity assay. A 30-lL reaction mixture wasprepared containing...
Chem Biol Drug Des 74: 547-59 (2009)
Article DOI: 10.1111/j.1747-0285.2009.00884.x
BindingDB Entry DOI: 10.7270/Q2930RPH