null
SMILES: Cc1cc(ccc1C(O)=O)C(=O)[n+]1cccc(c1)C(=O)NCc1ccc(cc1)-n1nc(cc1NC(=O)Nc1ccccc1)C(C)(C)C
InChI Key: InChIKey=QXXAWDUYRDCVFV-UHFFFAOYSA-O
Activity Spreadsheet -- Enzyme Inhibition Constant Data from BindingDB
Found 2 hits for monomerid = 84793
Trg + Lig
Ki
nM
ΔG°
kcal/mole
IC50
nM
Kd
nM
EC50/IC50
nM
koff
s-1
kon
M-1s-1
pHTemp
°C
Mitogen-activated protein kinase 14
(Homo sapiens (Human))
BDBM84793
((12b) BIRB796)
Show SMILES Cc1cc(ccc1C(O)=O)C(=O)[n+]1cccc(c1)C(=O)NCc1ccc(cc1)-n1nc(cc1NC(=O)Nc1ccccc1)C(C)(C)C
Show InChI InChI=1S/C36H34N6O5/c1-23-19-25(14-17-29(23)34(45)46)33(44)41-18-8-9-26(22-41)32(43)37-21-24-12-15-28(16-13-24)42-31(20-30(40-42)36(2,3)4)39-35(47)38-27-10-6-5-7-11-27/h5-20,22H,21H2,1-4H3,(H3-,37,38,39,40,43,45,46,47)/p+1
NCI pathway
Reactome pathway
n/an/a 62n/an/an/an/a7.525
Pfizer Inc.
Assay Description
Binding of inhibitors to unactivated p38a that leads to decreasedphosphorylation of p38alpha by MKK6 was determined by measuringthe activated p38alph...
Chem Biol Drug Des 74: 547-59 (2009)
Article DOI: 10.1111/j.1747-0285.2009.00884.x
BindingDB Entry DOI: 10.7270/Q2930RPH
Mitogen-activated protein kinase 14
(Homo sapiens (Human))
BDBM84793
((12b) BIRB796)
Show SMILES Cc1cc(ccc1C(O)=O)C(=O)[n+]1cccc(c1)C(=O)NCc1ccc(cc1)-n1nc(cc1NC(=O)Nc1ccccc1)C(C)(C)C
Show InChI InChI=1S/C36H34N6O5/c1-23-19-25(14-17-29(23)34(45)46)33(44)41-18-8-9-26(22-41)32(43)37-21-24-12-15-28(16-13-24)42-31(20-30(40-42)36(2,3)4)39-35(47)38-27-10-6-5-7-11-27/h5-20,22H,21H2,1-4H3,(H3-,37,38,39,40,43,45,46,47)/p+1
NCI pathway
Reactome pathway
n/an/a 1.47E+3n/an/an/an/a7.525
Pfizer Inc.
Assay Description
Inhibition of active p38a MAP kinase by inhibitors was determinedusing a p38a cascade activity assay. A 30-lL reaction mixture wasprepared containing...
Chem Biol Drug Des 74: 547-59 (2009)
Article DOI: 10.1111/j.1747-0285.2009.00884.x
BindingDB Entry DOI: 10.7270/Q2930RPH