null
SMILES: O=S1(=O)Oc2c3ccccc3c3OS(=O)(=O)N=c4ccc(=N1)c2c34
InChI Key: InChIKey=UETSSTUCMYSOAS-UHFFFAOYSA-N
Activity Spreadsheet -- Enzyme Inhibition Constant Data from BindingDB
Found 2 hits for monomerid = 84795
Trg + Lig
Ki
nM
ΔG°
kcal/mole
IC50
nM
Kd
nM
EC50/IC50
nM
koff
s-1
kon
M-1s-1
pHTemp
°C
Mitogen-activated protein kinase 14
(Homo sapiens (Human))
BDBM84795
(CP-232880)
Show SMILES O=S1(=O)Oc2c3ccccc3c3OS(=O)(=O)N=c4ccc(=N1)c2c34 |t:17,21|
Show InChI InChI=1S/C14H6N2O6S2/c17-23(18)15-9-5-6-10-12-11(9)13(21-23)7-3-1-2-4-8(7)14(12)22-24(19,20)16-10/h1-6H
NCI pathway
Reactome pathway
n/an/a 2.10E+3n/an/an/an/a7.525
Pfizer Inc.
Assay Description
Inhibition of active p38a MAP kinase by inhibitors was determinedusing a p38a cascade activity assay. A 30-lL reaction mixture wasprepared containing...
Chem Biol Drug Des 74: 547-59 (2009)
Article DOI: 10.1111/j.1747-0285.2009.00884.x
BindingDB Entry DOI: 10.7270/Q2930RPH
Mitogen-activated protein kinase 14
(Homo sapiens (Human))
BDBM84795
(CP-232880)
Show SMILES O=S1(=O)Oc2c3ccccc3c3OS(=O)(=O)N=c4ccc(=N1)c2c34 |t:17,21|
Show InChI InChI=1S/C14H6N2O6S2/c17-23(18)15-9-5-6-10-12-11(9)13(21-23)7-3-1-2-4-8(7)14(12)22-24(19,20)16-10/h1-6H
NCI pathway
Reactome pathway
n/an/a 1.03E+3n/an/an/an/a7.525
Pfizer Inc.
Assay Description
Binding of inhibitors to unactivated p38a that leads to decreasedphosphorylation of p38alpha by MKK6 was determined by measuringthe activated p38alph...
Chem Biol Drug Des 74: 547-59 (2009)
Article DOI: 10.1111/j.1747-0285.2009.00884.x
BindingDB Entry DOI: 10.7270/Q2930RPH