BDBM84962 Urea derivative, 6
SMILES: Oc1ccc(\C=C\c2ccc(NC(=O)Nc3ccccc3)cc2)cc1O
InChI Key: InChIKey=TUZDPOPGRYPYGE-VOTSOKGWSA-N
Data: 1 KI  1 IC50
Activity Spreadsheet -- Enzyme Inhibition Constant Data from BindingDB
Found 1 hit for monomerid = 84962
Trg + Lig
Ki
nM
ΔG°
kcal/mole
IC50
nM
Kd
nM
EC50/IC50
nM
koff
s-1
kon
M-1s-1
pHTemp
°C
Alpha-glucosidase MAL12
(Saccharomyces cerevisiae)
BDBM84962
(Urea derivative, 6)
Show SMILES Oc1ccc(\C=C\c2ccc(NC(=O)Nc3ccccc3)cc2)cc1O
Show InChI InChI=1S/C21H18N2O3/c24-19-13-10-16(14-20(19)25)7-6-15-8-11-18(12-9-15)23-21(26)22-17-4-2-1-3-5-17/h1-14,24-25H,(H2,22,23,26)/b7-6+
Reactome pathway
1.06E+4n/a 4.21E+4n/an/an/an/an/an/a
Gyeongsang National University
Assay Description
All enzymatic activities were determined by using the appropriate substrate (p-nitrophenyl-alpha-D-glucopyranoside, p-nitrophenyl-beta-D-gulcopyranos...
Chembiochem 11: 2125-31 (2010)
Article DOI: 10.1002/cbic.201000376
BindingDB Entry DOI: 10.7270/Q2542M33