BDBM85426 Glucosamine analog, 10
SMILES: Nc1cccc(c1)C(=O)NC1C(O)OC(CO)C(O)C1O
InChI Key: InChIKey=NQLJEXINBDFMBX-UHFFFAOYSA-N
Data: 1 IC50
Activity Spreadsheet -- Enzyme Inhibition Constant Data from BindingDB
Found 1 hit for monomerid = 85426
Trg + Lig
Ki
nM
ΔG°
kcal/mole
IC50
nM
Kd
nM
EC50/IC50
nM
koff
s-1
kon
M-1s-1
pHTemp
°C
Hexokinase
(Saccharomyces cerevisiae)
BDBM85426
(Glucosamine analog, 10)
Show SMILES Nc1cccc(c1)C(=O)NC1C(O)OC(CO)C(O)C1O
Show InChI InChI=1S/C13H18N2O6/c14-7-3-1-2-6(4-7)12(19)15-9-11(18)10(17)8(5-16)21-13(9)20/h1-4,8-11,13,16-18,20H,5,14H2,(H,15,19)
n/an/a 6.00E+6n/an/an/an/a7.625
Groupe de Chimie Organique Biologique
Assay Description
The assay phosphotransferase activity was followed spectrophotometrically b reduction of NADP in the presence of an excess of glucose-6-phosphate-deh...
J Enzym Inhib 12: 101-21 (1997)
Article DOI: 10.3109/14756369709035812
BindingDB Entry DOI: 10.7270/Q2KD1WGF