null
SMILES: OC(=O)c1cc(NC(=O)C(CS)Cc2ccccc2)c[nH]1
InChI Key: InChIKey=HFAKPQAVQJYLKO-UHFFFAOYSA-N
Activity Spreadsheet -- Enzyme Inhibition Constant Data from BindingDB
Found 1 hit for monomerid = 85433
Trg + Lig
Ki
nM
ΔG°
kcal/mole
IC50
nM
Kd
nM
EC50/IC50
nM
koff
s-1
kon
M-1s-1
pHTemp
°C
Neprilysin
(Rattus norvegicus (Rat))
BDBM85433
(NEP inhibitor, 6m)
Show SMILES OC(=O)c1cc(NC(=O)C(CS)Cc2ccccc2)c[nH]1
Show InChI InChI=1S/C15H16N2O3S/c18-14(17-12-7-13(15(19)20)16-8-12)11(9-21)6-10-4-2-1-3-5-10/h1-5,7-8,11,16,21H,6,9H2,(H,17,18)(H,19,20)
Reactome pathway
n/an/a 2n/an/an/an/an/a25
R&D, Zambon Group Spa
Assay Description
Enzyme inhibition assay using neutrol endopeptiase EC 3.4.24.11 (NEP).
J Enzym Inhib 12: 155-60 (1997)
Article DOI: 10.3109/14756369709035816
BindingDB Entry DOI: 10.7270/Q2FQ9V4F