BDBM85450 Epithioamino acid analogue, II(a)
SMILES: N[C@@H](C[C@@H]1CS1)C(O)=O
InChI Key: InChIKey=UDYCAAKNRHQYDZ-DMTCNVIQSA-N
Data: 1 KI  1 IC50
Activity Spreadsheet -- Enzyme Inhibition Constant Data from BindingDB
Found 1 hit for monomerid = 85450
Trg + Lig
Ki
nM
ΔG°
kcal/mole
IC50
nM
Kd
nM
EC50/IC50
nM
koff
s-1
kon
M-1s-1
pHTemp
°C
S-Adenosylmethionine Synthase (AdoMet)
(Rattus norvegicus)
BDBM85450
(Epithioamino acid analogue, II(a))
Show SMILES N[C@@H](C[C@@H]1CS1)C(O)=O |r|
Show InChI InChI=1S/C5H9NO2S/c6-4(5(7)8)1-3-2-9-3/h3-4H,1-2,6H2,(H,7,8)/t3-,4+/m1/s1
1.00E+5 -5.67 1.40E+5n/an/an/an/a7.537
Laboratoire de chimie bioorganique
Assay Description
AdoMet synthetase activity was measured by a radioactive assay using (14C-methyl)-L-methionine as described by Sullivan and Hoffman with minor modifi...
J Enzym Inhib 13: 361-7 (1998)
Article DOI: 10.3109/14756369809021481
BindingDB Entry DOI: 10.7270/Q2668BQ4