BDBM85451 Epithioamino acid analogue, II(b)
SMILES: C[C@H]1S[C@@H]1C[C@H](N)C(O)=O
InChI Key: InChIKey=KUYNDOOSKGGDRI-MROZADKFSA-N
Data: 1 KI  1 IC50
Activity Spreadsheet -- Enzyme Inhibition Constant Data from BindingDB
Found 1 hit for monomerid = 85451
Trg + Lig
Ki
nM
ΔG°
kcal/mole
IC50
nM
Kd
nM
EC50/IC50
nM
koff
s-1
kon
M-1s-1
pHTemp
°C
S-Adenosylmethionine Synthase (AdoMet)
(Rattus norvegicus)
BDBM85451
(Epithioamino acid analogue, II(b))
Show SMILES C[C@H]1S[C@@H]1C[C@H](N)C(O)=O |r|
Show InChI InChI=1S/C6H11NO2S/c1-3-5(10-3)2-4(7)6(8)9/h3-5H,2,7H2,1H3,(H,8,9)/t3-,4+,5-/m1/s1
1.40E+5 -5.47 3.00E+5n/an/an/an/a7.537
Laboratoire de chimie bioorganique
Assay Description
AdoMet synthetase activity was measured by a radioactive assay using (14C-methyl)-L-methionine as described by Sullivan and Hoffman with minor modifi...
J Enzym Inhib 13: 361-7 (1998)
Article DOI: 10.3109/14756369809021481
BindingDB Entry DOI: 10.7270/Q2668BQ4