BDBM85461 Pyrazolooxadiazinone, 2b
SMILES: Cc1nn(C)c2NC(=O)ONc12
InChI Key: InChIKey=CFZIJXUMOWKKGP-UHFFFAOYSA-N
Data: 1 KI
Activity Spreadsheet -- Enzyme Inhibition Constant Data from BindingDB
Found 1 hit for monomerid = 85461
Trg + Lig
Ki
nM
ΔG°
kcal/mole
IC50
nM
Kd
nM
EC50/IC50
nM
koff
s-1
kon
M-1s-1
pHTemp
°C
Leukocyte elastase
(Homo sapiens (Human))
BDBM85461
(Pyrazolooxadiazinone, 2b)
Show SMILES Cc1nn(C)c2NC(=O)ONc12
Show InChI InChI=1S/C6H8N4O2/c1-3-4-5(10(2)8-3)7-6(11)12-9-4/h9H,1-2H3,(H,7,11)
Reactome pathway
2.07E+5 -5.02n/an/an/an/an/an/a25
Università di Ferrara
Assay Description
The enzyme were assayed spectrophotometrically at 410nm with p-nitroanilide substrates at 25 C.
J Enzym Inhib 16: 15-34 (2001)
Article DOI: 10.1080/14756360109162352
BindingDB Entry DOI: 10.7270/Q2XP73FM