BDBM85659 DCP5
SMILES: NOC(=O)c1cc(Cl)c(Cl)c(c1)C(=O)ON
InChI Key: InChIKey=SSHMODVPGQFZJQ-UHFFFAOYSA-N
Data: 5 KI
Activity Spreadsheet -- Enzyme Inhibition Constant Data from BindingDB
Found 5 hits for monomerid = 85659
Trg + Lig
Ki
nM
ΔG°
kcal/mole
IC50
nM
Kd
nM
EC50/IC50
nM
koff
s-1
kon
M-1s-1
pHTemp
°C
Carbonic anhydrase 2
(Homo sapiens (Human))
BDBM85659
(DCP5)
Show SMILES NOC(=O)c1cc(Cl)c(Cl)c(c1)C(=O)ON
Show InChI InChI=1S/C8H6Cl2N2O4/c9-5-2-3(7(13)15-11)1-4(6(5)10)8(14)16-12/h1-2H,11-12H2
Reactome pathway
30 -10.1n/an/an/an/an/a7.420
Università degli Studi di Firenze
Assay Description
The initial rates of 4-nitrophenylacetate hydrolysis catalysed by different CA isozymes were monitored spectrophotometrically at 400nm with a Cary 3 ...
J Enzyme Inhib Med Chem 19: 269-73 (2004)
Article DOI: 10.1080/14756360410001689559
BindingDB Entry DOI: 10.7270/Q20C4TBB
Carbonic anhydrase 9
(Homo sapiens (Human))
BDBM85659
(DCP5)
Show SMILES NOC(=O)c1cc(Cl)c(Cl)c(c1)C(=O)ON
Show InChI InChI=1S/C8H6Cl2N2O4/c9-5-2-3(7(13)15-11)1-4(6(5)10)8(14)16-12/h1-2H,11-12H2
NCI pathway
Reactome pathway
50 -9.79n/an/an/an/an/a7.420
Università degli Studi di Firenze
Assay Description
The initial rates of 4-nitrophenylacetate hydrolysis catalysed by different CA isozymes were monitored spectrophotometrically at 400nm with a Cary 3 ...
J Enzyme Inhib Med Chem 19: 269-73 (2004)
Article DOI: 10.1080/14756360410001689559
BindingDB Entry DOI: 10.7270/Q20C4TBB
Carbonic anhydrase 4
(Homo sapiens (Human))
BDBM85659
(DCP5)
Show SMILES NOC(=O)c1cc(Cl)c(Cl)c(c1)C(=O)ON
Show InChI InChI=1S/C8H6Cl2N2O4/c9-5-2-3(7(13)15-11)1-4(6(5)10)8(14)16-12/h1-2H,11-12H2
Reactome pathway
120 -9.28n/an/an/an/an/a7.420
Università degli Studi di Firenze
Assay Description
The initial rates of 4-nitrophenylacetate hydrolysis catalysed by different CA isozymes were monitored spectrophotometrically at 400nm with a Cary 3 ...
J Enzyme Inhib Med Chem 19: 269-73 (2004)
Article DOI: 10.1080/14756360410001689559
BindingDB Entry DOI: 10.7270/Q20C4TBB
Carbonic anhydrase 1
(Homo sapiens (Human))
BDBM85659
(DCP5)
Show SMILES NOC(=O)c1cc(Cl)c(Cl)c(c1)C(=O)ON
Show InChI InChI=1S/C8H6Cl2N2O4/c9-5-2-3(7(13)15-11)1-4(6(5)10)8(14)16-12/h1-2H,11-12H2
NCI pathway
Reactome pathway
350 -8.65n/an/an/an/an/a7.420
Università degli Studi di Firenze
Assay Description
The initial rates of 4-nitrophenylacetate hydrolysis catalysed by different CA isozymes were monitored spectrophotometrically at 400nm with a Cary 3 ...
J Enzyme Inhib Med Chem 19: 269-73 (2004)
Article DOI: 10.1080/14756360410001689559
BindingDB Entry DOI: 10.7270/Q20C4TBB
Carbonic Anhydrase V
(Mus musculus (mouse))
BDBM85659
(DCP5)
Show SMILES NOC(=O)c1cc(Cl)c(Cl)c(c1)C(=O)ON
Show InChI InChI=1S/C8H6Cl2N2O4/c9-5-2-3(7(13)15-11)1-4(6(5)10)8(14)16-12/h1-2H,11-12H2
Reactome pathway
640 -8.30n/an/an/an/an/a7.420
Università degli Studi di Firenze
Assay Description
The initial rates of 4-nitrophenylacetate hydrolysis catalysed by different CA isozymes were monitored spectrophotometrically at 400nm with a Cary 3 ...
J Enzyme Inhib Med Chem 19: 269-73 (2004)
Article DOI: 10.1080/14756360410001689559
BindingDB Entry DOI: 10.7270/Q20C4TBB