BDBM86100 2-Cyanopyrrolidine Derivative, 29
SMILES: O=C(NC(Cc1ccccc1)C(=O)N1CCC[C@H]1C#N)c1ccccc1
InChI Key: InChIKey=ORYDQECCZWMFEJ-OYKVQYDMSA-N
Data: 2 KI
Activity Spreadsheet -- Enzyme Inhibition Constant Data from BindingDB
Found 2 hits for monomerid = 86100
Trg + Lig
Ki
nM
ΔG°
kcal/mole
IC50
nM
Kd
nM
EC50/IC50
nM
koff
s-1
kon
M-1s-1
pHTemp
°C
Cathepsin B
(Homo sapiens (Human))
BDBM86100
(2-Cyanopyrrolidine Derivative, 29)
Show SMILES O=C(NC(Cc1ccccc1)C(=O)N1CCC[C@H]1C#N)c1ccccc1 |r|
Show InChI InChI=1S/C21H21N3O2/c22-15-18-12-7-13-24(18)21(26)19(14-16-8-3-1-4-9-16)23-20(25)17-10-5-2-6-11-17/h1-6,8-11,18-19H,7,12-14H2,(H,23,25)/t18-,19?/m0/s1
Reactome pathway
>1.00E+5>-5.42n/an/an/an/an/a6.023
The M S University of Baroda
Assay Description
The fluorescence for the assay was monitored on a Varian Gemini spectrofluorometer with the excitation and emission wavelengths at 380 and 440nm. Th...
J Enzyme Inhib Med Chem 23: 190-7 (2008)
Article DOI: 10.1080/14756360701504842
BindingDB Entry DOI: 10.7270/Q2DV1HFC
Cathepsin B
(Homo sapiens (Human))
BDBM86100
(2-Cyanopyrrolidine Derivative, 29)
Show SMILES O=C(NC(Cc1ccccc1)C(=O)N1CCC[C@H]1C#N)c1ccccc1 |r|
Show InChI InChI=1S/C21H21N3O2/c22-15-18-12-7-13-24(18)21(26)19(14-16-8-3-1-4-9-16)23-20(25)17-10-5-2-6-11-17/h1-6,8-11,18-19H,7,12-14H2,(H,23,25)/t18-,19?/m0/s1
Reactome pathway
>1.00E+5>-5.42n/an/an/an/an/a6.023
The M S University of Baroda
Assay Description
The fluorescence for the assay was monitored on a Varian Gemini spectrofluorometer with the excitation and emission wavelengths at 380 and 440nm. Th...
J Enzyme Inhib Med Chem 23: 190-7 (2008)
Article DOI: 10.1080/14756360701504842
BindingDB Entry DOI: 10.7270/Q2DV1HFC