BDBM86615 Benzo[e]pyrimido[5,4-b][1,4]diazepin-6(11H)-one, 21
SMILES: CN1CCN(CC1)C(=O)c1ccc(Nc2ncc3N(C)C(=O)c4ccccc4N(C)c3n2)cc1C
InChI Key: InChIKey=PHENCDSAYZNXRO-UHFFFAOYSA-N
Data: 2 IC50
Activity Spreadsheet -- Enzyme Inhibition Constant Data from BindingDB
Found 2 hits for monomerid = 86615
Trg + Lig
Ki
nM
ΔG°
kcal/mole
IC50
nM
Kd
nM
EC50/IC50
nM
koff
s-1
kon
M-1s-1
pHTemp
°C
Aurora kinase B
(Homo sapiens (Human))
BDBM86615
(Benzo[e]pyrimido[5,4-b][1,4]diazepin-6(11H)-one, 2...)
Show SMILES CN1CCN(CC1)C(=O)c1ccc(Nc2ncc3N(C)C(=O)c4ccccc4N(C)c3n2)cc1C
Show InChI InChI=1S/C26H29N7O2/c1-17-15-18(9-10-19(17)25(35)33-13-11-30(2)12-14-33)28-26-27-16-22-23(29-26)31(3)21-8-6-5-7-20(21)24(34)32(22)4/h5-10,15-16H,11-14H2,1-4H3,(H,27,28,29)
Reactome pathway
n/an/a 14.5n/an/an/an/an/an/a
Harvard Medical School
Assay Description
In vitro kinase assay of Aurora A, B, and C using Z-LYTE technology (Invitrogen) and ATP at Km apparent for each kinase.
ACS Chem Biol 7: 185-96 (2012)
Article DOI: 10.1021/cb200305u
BindingDB Entry DOI: 10.7270/Q2PV6HZG
Aurora kinase A
(Homo sapiens (Human))
BDBM86615
(Benzo[e]pyrimido[5,4-b][1,4]diazepin-6(11H)-one, 2...)
Show SMILES CN1CCN(CC1)C(=O)c1ccc(Nc2ncc3N(C)C(=O)c4ccccc4N(C)c3n2)cc1C
Show InChI InChI=1S/C26H29N7O2/c1-17-15-18(9-10-19(17)25(35)33-13-11-30(2)12-14-33)28-26-27-16-22-23(29-26)31(3)21-8-6-5-7-20(21)24(34)32(22)4/h5-10,15-16H,11-14H2,1-4H3,(H,27,28,29)
NCI pathway
Reactome pathway
n/an/a 3.70n/an/an/an/an/an/a
Harvard Medical School
Assay Description
In vitro kinase assay of Aurora A, B, and C using Z-LYTE technology (Invitrogen) and ATP at Km apparent for each kinase.
ACS Chem Biol 7: 185-96 (2012)
Article DOI: 10.1021/cb200305u
BindingDB Entry DOI: 10.7270/Q2PV6HZG