null
SMILES: COc1cccc(c1)-n1ncc2c(N=NCc3cccc(c3)S(C)(=O)=O)ncnc12
InChI Key: InChIKey=NZBIDKMWCLSREQ-UHFFFAOYSA-N
Activity Spreadsheet -- Enzyme Inhibition Constant Data from BindingDB
Found 1 hit for monomerid = 8687
Trg + Lig
Ki
nM
ΔG°
kcal/mole
IC50
nM
Kd
nM
EC50/IC50
nM
koff
s-1
kon
M-1s-1
pHTemp
°C
Glycogen synthase kinase-3 beta
(Homo sapiens (Human))
BDBM8687
((1E)-1-[(3-methanesulfonylphenyl)methylidene]-2-[1...)
Show SMILES COc1cccc(c1)-n1ncc2c(N=NCc3cccc(c3)S(C)(=O)=O)ncnc12 |w:13.13|
Show InChI InChI=1S/C20H18N6O3S/c1-29-16-7-4-6-15(10-16)26-20-18(12-24-26)19(21-13-22-20)25-23-11-14-5-3-8-17(9-14)30(2,27)28/h3-10,12-13H,11H2,1-2H3
NCI pathway
Reactome pathway
n/an/a 3.98n/an/an/an/an/an/a
GlaxoSmithKline
Assay Description
The biochemical activity of compounds was determined by incubation with specific enzyme and substrate in the presence 2.5 uM ATP/ [gamma-33P] ATP. Af...
Bioorg Med Chem Lett 14: 2121-5 (2004)
Article DOI: 10.1016/j.bmcl.2004.02.036
BindingDB Entry DOI: 10.7270/Q2NV9GF5