null
SMILES: CCNCc1ccc(CN=Nc2ncnc3n(ncc23)-c2cccc(OC)c2)cc1
InChI Key: InChIKey=PMORDRJSLRRWLQ-UHFFFAOYSA-N
Activity Spreadsheet -- Enzyme Inhibition Constant Data from BindingDB
Found 1 hit for monomerid = 8695
Trg + Lig
Ki
nM
ΔG°
kcal/mole
IC50
nM
Kd
nM
EC50/IC50
nM
koff
s-1
kon
M-1s-1
pHTemp
°C
Glycogen synthase kinase-3 beta
(Homo sapiens (Human))
BDBM8695
(ethyl({4-[(1E)-{2-[1-(3-methoxyphenyl)-1H-pyrazolo...)
Show SMILES CCNCc1ccc(CN=Nc2ncnc3n(ncc23)-c2cccc(OC)c2)cc1 |w:10.10|
Show InChI InChI=1S/C22H23N7O/c1-3-23-12-16-7-9-17(10-8-16)13-26-28-21-20-14-27-29(22(20)25-15-24-21)18-5-4-6-19(11-18)30-2/h4-11,14-15,23H,3,12-13H2,1-2H3
NCI pathway
Reactome pathway
n/an/a 3.98n/an/an/an/an/an/a
GlaxoSmithKline
Assay Description
The biochemical activity of compounds was determined by incubation with specific enzyme and substrate in the presence 2.5 uM ATP/ [gamma-33P] ATP. Af...
Bioorg Med Chem Lett 14: 2121-5 (2004)
Article DOI: 10.1016/j.bmcl.2004.02.036
BindingDB Entry DOI: 10.7270/Q2NV9GF5