null
SMILES: C[C@@H](CN1CCC(CC1)n1c2ccccc2[nH]c1=O)NC(=O)c1cc2ccccc2s1
InChI Key: InChIKey=REVZYRDPYGXHCC-INIZCTEOSA-N
Activity Spreadsheet -- Enzyme Inhibition Constant Data from BindingDB
Found 2 hits for monomerid = 87190
Trg + Lig
Ki
nM
ΔG°
kcal/mole
IC50
nM
Kd
nM
EC50/IC50
nM
koff
s-1
kon
M-1s-1
pHTemp
°C
Phospholipase D1
(Homo sapiens (Human))
BDBM87190
(N-[(1S)-2-[4-(2-keto-3H-benzimidazol-1-yl)piperidi...)
Show SMILES C[C@@H](CN1CCC(CC1)n1c2ccccc2[nH]c1=O)NC(=O)c1cc2ccccc2s1
Show InChI InChI=1S/C24H26N4O2S/c1-16(25-23(29)22-14-17-6-2-5-9-21(17)31-22)15-27-12-10-18(11-13-27)28-20-8-4-3-7-19(20)26-24(28)30/h2-9,14,16,18H,10-13,15H2,1H3,(H,25,29)(H,26,30)/t16-/m0/s1
PCBioAssay
n/an/a 2n/an/an/an/an/an/a
Vanderbilt Specialized Chemistry Center
Curated by PubChem BioAssay
Assay Description
Phospholipase D (PLD) generates the lipid second messenger phosphatidic acid as part of a plethora of cellular functions. Phosphatidic acid (PtdOH) i...
PubChem Bioassay (2011)
BindingDB Entry DOI: 10.7270/Q2NK3CNK
Phospholipase D2
(Homo sapiens (Human))
BDBM87190
(N-[(1S)-2-[4-(2-keto-3H-benzimidazol-1-yl)piperidi...)
Show SMILES C[C@@H](CN1CCC(CC1)n1c2ccccc2[nH]c1=O)NC(=O)c1cc2ccccc2s1
Show InChI InChI=1S/C24H26N4O2S/c1-16(25-23(29)22-14-17-6-2-5-9-21(17)31-22)15-27-12-10-18(11-13-27)28-20-8-4-3-7-19(20)26-24(28)30/h2-9,14,16,18H,10-13,15H2,1H3,(H,25,29)(H,26,30)/t16-/m0/s1
Reactome pathway
PCBioAssay
n/an/a 220n/an/an/an/an/an/a
Vanderbilt Specialized Chemistry Center
Curated by PubChem BioAssay
Assay Description
Phospholipase D (PLD) generates the lipid second messenger phosphatidic acid as part of a plethora of cellular functions. Phosphatidic acid (PtdOH) i...
PubChem Bioassay (2011)
BindingDB Entry DOI: 10.7270/Q21R6P4V