BDBM87193 5-fluoranyl-N-[(2S)-1-[4-(2-oxidanylidene-3H-benzimidazol-1-yl)piperidin-1-yl]propan-2-yl]-1H-indole-2-carboxamide::5-fluoro-N-[(1S)-2-[4-(2-keto-3H-benzimidazol-1-yl)piperidino]-1-methyl-ethyl]-1H-indole-2-carboxamide::5-fluoro-N-[(2S)-1-[4-(2-oxo-3H-benzimidazol-1-yl)-1-piperidinyl]propan-2-yl]-1H-indole-2-carboxamide::5-fluoro-N-[(2S)-1-[4-(2-oxo-3H-benzimidazol-1-yl)piperidin-1-yl]propan-2-yl]-1H-indole-2-carboxamide::VU0361539-1::cid_53470150
SMILES: C[C@@H](CN1CCC(CC1)n1c2ccccc2[nH]c1=O)NC(=O)c1cc2cc(F)ccc2[nH]1
InChI Key: InChIKey=MSSVPLXKRPFKDV-HNNXBMFYSA-N
Data: 2 IC50
Activity Spreadsheet -- Enzyme Inhibition Constant Data from BindingDB
Found 2 hits for monomerid = 87193
Trg + Lig
Ki
nM
ΔG°
kcal/mole
IC50
nM
Kd
nM
EC50/IC50
nM
koff
s-1
kon
M-1s-1
pHTemp
°C
Phospholipase D (PLD)
(Homo sapiens (Human))
BDBM87193
(5-fluoranyl-N-[(2S)-1-[4-(2-oxidanylidene-3H-benzi...)
Show SMILES C[C@@H](CN1CCC(CC1)n1c2ccccc2[nH]c1=O)NC(=O)c1cc2cc(F)ccc2[nH]1
Show InChI InChI=1S/C24H26FN5O2/c1-15(26-23(31)21-13-16-12-17(25)6-7-19(16)27-21)14-29-10-8-18(9-11-29)30-22-5-3-2-4-20(22)28-24(30)32/h2-7,12-13,15,18,27H,8-11,14H2,1H3,(H,26,31)(H,28,32)/t15-/m0/s1
PCBioAssay
n/an/a 1n/an/an/an/an/an/a
Vanderbilt Specialized Chemistry Center
Curated by PubChem BioAssay
Assay Description
Phospholipase D (PLD) generates the lipid second messenger phosphatidic acid as part of a plethora of cellular functions. Phosphatidic acid (PtdOH) i...
PubChem Bioassay (2011)
BindingDB Entry DOI: 10.7270/Q2NK3CNK
Phospholipase D2 (PLD2)
(Homo sapiens (Human))
BDBM87193
(5-fluoranyl-N-[(2S)-1-[4-(2-oxidanylidene-3H-benzi...)
Show SMILES C[C@@H](CN1CCC(CC1)n1c2ccccc2[nH]c1=O)NC(=O)c1cc2cc(F)ccc2[nH]1
Show InChI InChI=1S/C24H26FN5O2/c1-15(26-23(31)21-13-16-12-17(25)6-7-19(16)27-21)14-29-10-8-18(9-11-29)30-22-5-3-2-4-20(22)28-24(30)32/h2-7,12-13,15,18,27H,8-11,14H2,1H3,(H,26,31)(H,28,32)/t15-/m0/s1
Reactome pathway
PCBioAssay
n/an/a 130n/an/an/an/an/an/a
Vanderbilt Specialized Chemistry Center
Curated by PubChem BioAssay
Assay Description
Phospholipase D (PLD) generates the lipid second messenger phosphatidic acid as part of a plethora of cellular functions. Phosphatidic acid (PtdOH) i...
PubChem Bioassay (2011)
BindingDB Entry DOI: 10.7270/Q21R6P4V