BDBM87213 N-[(1S)-2-[4-(5-bromo-2-keto-3H-benzimidazol-1-yl)piperidino]-1-methyl-ethyl]-4-fluoro-benzamide;2,2,2-trifluoroacetic acid::N-[(2S)-1-[4-(5-bromanyl-2-oxidanylidene-3H-benzimidazol-1-yl)piperidin-1-yl]propan-2-yl]-4-fluoranyl-benzamide;2,2,2-tris(fluoranyl)ethanoic acid::N-[(2S)-1-[4-(5-bromo-2-oxo-3H-benzimidazol-1-yl)-1-piperidinyl]propan-2-yl]-4-fluorobenzamide;2,2,2-trifluoroacetic acid::N-[(2S)-1-[4-(5-bromo-2-oxo-3H-benzimidazol-1-yl)piperidin-1-yl]propan-2-yl]-4-fluorobenzamide;2,2,2-trifluoroacetic acid::VU0359592-1::cid_53470189
SMILES: C[C@@H](CN1CCC(CC1)n1c2ccc(Br)cc2[nH]c1=O)NC(=O)c1ccc(F)cc1
InChI Key: InChIKey=QYLRVQUJNPPZPM-AWEZNQCLSA-N
Data: 2 IC50
Activity Spreadsheet -- Enzyme Inhibition Constant Data from BindingDB
Found 2 hits for monomerid = 87213
Trg + Lig
Ki
nM
ΔG°
kcal/mole
IC50
nM
Kd
nM
EC50/IC50
nM
koff
s-1
kon
M-1s-1
pHTemp
°C
Phospholipase D (PLD)
(Homo sapiens (Human))
BDBM87213
(N-[(1S)-2-[4-(5-bromo-2-keto-3H-benzimidazol-1-yl)...)
Show SMILES C[C@@H](CN1CCC(CC1)n1c2ccc(Br)cc2[nH]c1=O)NC(=O)c1ccc(F)cc1
Show InChI InChI=1S/C22H24BrFN4O2/c1-14(25-21(29)15-2-5-17(24)6-3-15)13-27-10-8-18(9-11-27)28-20-7-4-16(23)12-19(20)26-22(28)30/h2-7,12,14,18H,8-11,13H2,1H3,(H,25,29)(H,26,30)/t14-/m0/s1
PCBioAssay
n/an/a 4n/an/an/an/an/an/a
Vanderbilt Specialized Chemistry Center
Curated by PubChem BioAssay
Assay Description
Phospholipase D (PLD) generates the lipid second messenger phosphatidic acid as part of a plethora of cellular functions. Phosphatidic acid (PtdOH) i...
PubChem Bioassay (2011)
BindingDB Entry DOI: 10.7270/Q2NK3CNK
Phospholipase D2 (PLD2)
(Homo sapiens (Human))
BDBM87213
(N-[(1S)-2-[4-(5-bromo-2-keto-3H-benzimidazol-1-yl)...)
Show SMILES C[C@@H](CN1CCC(CC1)n1c2ccc(Br)cc2[nH]c1=O)NC(=O)c1ccc(F)cc1
Show InChI InChI=1S/C22H24BrFN4O2/c1-14(25-21(29)15-2-5-17(24)6-3-15)13-27-10-8-18(9-11-27)28-20-7-4-16(23)12-19(20)26-22(28)30/h2-7,12,14,18H,8-11,13H2,1H3,(H,25,29)(H,26,30)/t14-/m0/s1
Reactome pathway
PCBioAssay
n/an/a 340n/an/an/an/an/an/a
Vanderbilt Specialized Chemistry Center
Curated by PubChem BioAssay
Assay Description
Phospholipase D (PLD) generates the lipid second messenger phosphatidic acid as part of a plethora of cellular functions. Phosphatidic acid (PtdOH) i...
PubChem Bioassay (2011)
BindingDB Entry DOI: 10.7270/Q21R6P4V