BDBM87214 N-[(1S)-2-[4-(5-bromo-2-keto-3H-benzimidazol-1-yl)piperidino]-1-methyl-ethyl]-3,4-difluoro-benzamide;2,2,2-trifluoroacetic acid::N-[(2S)-1-[4-(5-bromanyl-2-oxidanylidene-3H-benzimidazol-1-yl)piperidin-1-yl]propan-2-yl]-3,4-bis(fluoranyl)benzamide;2,2,2-tris(fluoranyl)ethanoic acid::N-[(2S)-1-[4-(5-bromo-2-oxo-3H-benzimidazol-1-yl)-1-piperidinyl]propan-2-yl]-3,4-difluorobenzamide;2,2,2-trifluoroacetic acid::N-[(2S)-1-[4-(5-bromo-2-oxo-3H-benzimidazol-1-yl)piperidin-1-yl]propan-2-yl]-3,4-difluorobenzamide;2,2,2-trifluoroacetic acid::VU0359593-1::cid_53470191
SMILES: C[C@@H](CN1CCC(CC1)n1c2ccc(Br)cc2[nH]c1=O)NC(=O)c1ccc(F)c(F)c1
InChI Key: InChIKey=HBVVABXIVRGPET-ZDUSSCGKSA-N
Data: 2 IC50
Activity Spreadsheet -- Enzyme Inhibition Constant Data from BindingDB
Found 2 hits for monomerid = 87214
Trg + Lig
Ki
nM
ΔG°
kcal/mole
IC50
nM
Kd
nM
EC50/IC50
nM
koff
s-1
kon
M-1s-1
pHTemp
°C
Phospholipase D (PLD)
(Homo sapiens (Human))
BDBM87214
(N-[(1S)-2-[4-(5-bromo-2-keto-3H-benzimidazol-1-yl)...)
Show SMILES C[C@@H](CN1CCC(CC1)n1c2ccc(Br)cc2[nH]c1=O)NC(=O)c1ccc(F)c(F)c1
Show InChI InChI=1S/C22H23BrF2N4O2/c1-13(26-21(30)14-2-4-17(24)18(25)10-14)12-28-8-6-16(7-9-28)29-20-5-3-15(23)11-19(20)27-22(29)31/h2-5,10-11,13,16H,6-9,12H2,1H3,(H,26,30)(H,27,31)/t13-/m0/s1
PCBioAssay
n/an/a 4n/an/an/an/an/an/a
Vanderbilt Specialized Chemistry Center
Curated by PubChem BioAssay
Assay Description
Phospholipase D (PLD) generates the lipid second messenger phosphatidic acid as part of a plethora of cellular functions. Phosphatidic acid (PtdOH) i...
PubChem Bioassay (2011)
BindingDB Entry DOI: 10.7270/Q2NK3CNK
Phospholipase D2 (PLD2)
(Homo sapiens (Human))
BDBM87214
(N-[(1S)-2-[4-(5-bromo-2-keto-3H-benzimidazol-1-yl)...)
Show SMILES C[C@@H](CN1CCC(CC1)n1c2ccc(Br)cc2[nH]c1=O)NC(=O)c1ccc(F)c(F)c1
Show InChI InChI=1S/C22H23BrF2N4O2/c1-13(26-21(30)14-2-4-17(24)18(25)10-14)12-28-8-6-16(7-9-28)29-20-5-3-15(23)11-19(20)27-22(29)31/h2-5,10-11,13,16H,6-9,12H2,1H3,(H,26,30)(H,27,31)/t13-/m0/s1
Reactome pathway
PCBioAssay
n/an/a 187n/an/an/an/an/an/a
Vanderbilt Specialized Chemistry Center
Curated by PubChem BioAssay
Assay Description
Phospholipase D (PLD) generates the lipid second messenger phosphatidic acid as part of a plethora of cellular functions. Phosphatidic acid (PtdOH) i...
PubChem Bioassay (2011)
BindingDB Entry DOI: 10.7270/Q21R6P4V