null
SMILES: C[C@@H](CN1CCC(CC1)n1c2cc(F)ccc2[nH]c1=O)NC(=O)c1ccc2ccccc2c1
InChI Key: InChIKey=MDMOJYODKZQMGP-KRWDZBQOSA-N
Activity Spreadsheet -- Enzyme Inhibition Constant Data from BindingDB
Found 2 hits for monomerid = 87228
Trg + Lig
Ki
nM
ΔG°
kcal/mole
IC50
nM
Kd
nM
EC50/IC50
nM
koff
s-1
kon
M-1s-1
pHTemp
°C
Phospholipase D1
(Homo sapiens (Human))
BDBM87228
(N-[(1S)-2-[4-(6-fluoro-2-keto-3H-benzimidazol-1-yl...)
Show SMILES C[C@@H](CN1CCC(CC1)n1c2cc(F)ccc2[nH]c1=O)NC(=O)c1ccc2ccccc2c1
Show InChI InChI=1S/C26H27FN4O2/c1-17(28-25(32)20-7-6-18-4-2-3-5-19(18)14-20)16-30-12-10-22(11-13-30)31-24-15-21(27)8-9-23(24)29-26(31)33/h2-9,14-15,17,22H,10-13,16H2,1H3,(H,28,32)(H,29,33)/t17-/m0/s1
PCBioAssay
n/an/a 3n/an/an/an/an/an/a
Vanderbilt Specialized Chemistry Center
Curated by PubChem BioAssay
Assay Description
Phospholipase D (PLD) generates the lipid second messenger phosphatidic acid as part of a plethora of cellular functions. Phosphatidic acid (PtdOH) i...
PubChem Bioassay (2011)
BindingDB Entry DOI: 10.7270/Q2NK3CNK
Phospholipase D2
(Homo sapiens (Human))
BDBM87228
(N-[(1S)-2-[4-(6-fluoro-2-keto-3H-benzimidazol-1-yl...)
Show SMILES C[C@@H](CN1CCC(CC1)n1c2cc(F)ccc2[nH]c1=O)NC(=O)c1ccc2ccccc2c1
Show InChI InChI=1S/C26H27FN4O2/c1-17(28-25(32)20-7-6-18-4-2-3-5-19(18)14-20)16-30-12-10-22(11-13-30)31-24-15-21(27)8-9-23(24)29-26(31)33/h2-9,14-15,17,22H,10-13,16H2,1H3,(H,28,32)(H,29,33)/t17-/m0/s1
Reactome pathway
PCBioAssay
n/an/a 460n/an/an/an/an/an/a
Vanderbilt Specialized Chemistry Center
Curated by PubChem BioAssay
Assay Description
Phospholipase D (PLD) generates the lipid second messenger phosphatidic acid as part of a plethora of cellular functions. Phosphatidic acid (PtdOH) i...
PubChem Bioassay (2011)
BindingDB Entry DOI: 10.7270/Q21R6P4V