BDBM8764 1,2,3,4-Tetrahydropyrido[3,4-b]indole 9::methyl 5-{2-[(4-hydroxyphenyl)carbonyl]-1H,2H,3H,4H,9H-pyrido[3,4-b]indol-9-yl}pentanoate
SMILES: COC(=O)CCCCn1c2CN(CCc2c2ccccc12)C(=O)c1ccc(O)cc1
InChI Key: InChIKey=UOKCHPKAWHMZFR-UHFFFAOYSA-N
Data: 2 IC50
Activity Spreadsheet -- Enzyme Inhibition Constant Data from BindingDB
Found 2 hits for monomerid = 8764
Trg + Lig
Ki
nM
ΔG°
kcal/mole
IC50
nM
Kd
nM
EC50/IC50
nM
koff
s-1
kon
M-1s-1
pHTemp
°C
Enoyl-ACP Reductase (FabI)
(Escherichia coli)
BDBM8764
(1,2,3,4-Tetrahydropyrido[3,4-b]indole 9 | methyl 5...)
Show SMILES COC(=O)CCCCn1c2CN(CCc2c2ccccc12)C(=O)c1ccc(O)cc1
Show InChI InChI=1S/C24H26N2O4/c1-30-23(28)8-4-5-14-26-21-7-3-2-6-19(21)20-13-15-25(16-22(20)26)24(29)17-9-11-18(27)12-10-17/h2-3,6-7,9-12,27H,4-5,8,13-16H2,1H3
n/an/a 2.68E+4n/an/an/an/an/a30
GlaxoSmithKline
Assay Description
Assays were carried out in half-area, 96-well microtiter plates. Compounds were evaluated in assay mixtures containing components specific for each e...
Bioorg Med Chem Lett 11: 2241-4 (2001)
Article DOI: 10.1016/s0960-894x(01)00405-x
BindingDB Entry DOI: 10.7270/Q24X5610
Enoyl-ACP Reductase (FabI)
(Staphylococcus aureus)
BDBM8764
(1,2,3,4-Tetrahydropyrido[3,4-b]indole 9 | methyl 5...)
Show SMILES COC(=O)CCCCn1c2CN(CCc2c2ccccc12)C(=O)c1ccc(O)cc1
Show InChI InChI=1S/C24H26N2O4/c1-30-23(28)8-4-5-14-26-21-7-3-2-6-19(21)20-13-15-25(16-22(20)26)24(29)17-9-11-18(27)12-10-17/h2-3,6-7,9-12,27H,4-5,8,13-16H2,1H3
n/an/a 4.60E+3n/an/an/an/a6.530
GlaxoSmithKline
Assay Description
Assays were carried out in half-area, 96-well microtiter plates. Compounds were evaluated in assay mixtures containing components specific for each e...
Bioorg Med Chem Lett 11: 2241-4 (2001)
Article DOI: 10.1016/s0960-894x(01)00405-x
BindingDB Entry DOI: 10.7270/Q24X5610