BDBM8788 1,2,3,4-tetrahydro pyrido[3,4-b]indole 32::4-({9-[(4-hydroxyphenyl)methyl]-1H,2H,3H,4H,9H-pyrido[3,4-b]indol-2-yl}carbonyl)-2-methylphenol
SMILES: Cc1cc(ccc1O)C(=O)N1CCc2c(C1)n(Cc1ccc(O)cc1)c1ccccc21
InChI Key: InChIKey=SPODNTXMIFLQLS-UHFFFAOYSA-N
Data: 2 IC50
PDB links: 1 PDB ID contains inhibitors having a similarity of 90% to this monomer.
Activity Spreadsheet -- Enzyme Inhibition Constant Data from BindingDB
Found 2 hits for monomerid = 8788
Trg + Lig
Ki
nM
ΔG°
kcal/mole
IC50
nM
Kd
nM
EC50/IC50
nM
koff
s-1
kon
M-1s-1
pHTemp
°C
Enoyl-ACP Reductase (FabI)
(Escherichia coli)
BDBM8788
(1,2,3,4-tetrahydro pyrido[3,4-b]indole 32 | 4-({9-...)
Show SMILES Cc1cc(ccc1O)C(=O)N1CCc2c(C1)n(Cc1ccc(O)cc1)c1ccccc21
Show InChI InChI=1S/C26H24N2O3/c1-17-14-19(8-11-25(17)30)26(31)27-13-12-22-21-4-2-3-5-23(21)28(24(22)16-27)15-18-6-9-20(29)10-7-18/h2-11,14,29-30H,12-13,15-16H2,1H3
n/an/a 4.40E+3n/an/an/an/an/a30
GlaxoSmithKline
Assay Description
Assays were carried out in half-area, 96-well microtiter plates. Compounds were evaluated in assay mixtures containing components specific for each e...
Bioorg Med Chem Lett 11: 2241-4 (2001)
Article DOI: 10.1016/s0960-894x(01)00405-x
BindingDB Entry DOI: 10.7270/Q24X5610
Enoyl-ACP Reductase (FabI)
(Staphylococcus aureus)
BDBM8788
(1,2,3,4-tetrahydro pyrido[3,4-b]indole 32 | 4-({9-...)
Show SMILES Cc1cc(ccc1O)C(=O)N1CCc2c(C1)n(Cc1ccc(O)cc1)c1ccccc21
Show InChI InChI=1S/C26H24N2O3/c1-17-14-19(8-11-25(17)30)26(31)27-13-12-22-21-4-2-3-5-23(21)28(24(22)16-27)15-18-6-9-20(29)10-7-18/h2-11,14,29-30H,12-13,15-16H2,1H3
n/an/a 180n/an/an/an/an/a30
GlaxoSmithKline
Assay Description
Assays were carried out in half-area, 96-well microtiter plates. Compounds were evaluated in assay mixtures containing components specific for each e...
Bioorg Med Chem Lett 11: 2241-4 (2001)
Article DOI: 10.1016/s0960-894x(01)00405-x
BindingDB Entry DOI: 10.7270/Q24X5610