BDBM88121 US10245267, Example 1157::US10709712, Example 1157::US9694016, 1157
SMILES: Cc1ccc(NC(=O)c2ccnc(c2)C2CC2)cc1-c1cc(OCCO)nc(c1)N1CCOCC1
InChI Key: InChIKey=WNAUAJUEJOIWKE-UHFFFAOYSA-N
Data: 6 IC50
Activity Spreadsheet -- Enzyme Inhibition Constant Data from BindingDB
Found 6 hits for monomerid = 88121
Trg + Lig
Ki
nM
ΔG°
kcal/mole
IC50
nM
Kd
nM
EC50/IC50
nM
koff
s-1
kon
M-1s-1
pHTemp
°C
B-RAF V600E
(Homo sapiens (Human))
BDBM88121
(US10245267, Example 1157 | US10709712, Example 115...)
Show SMILES Cc1ccc(NC(=O)c2ccnc(c2)C2CC2)cc1-c1cc(OCCO)nc(c1)N1CCOCC1
Show InChI InChI=1S/C27H30N4O4/c1-18-2-5-22(29-27(33)20-6-7-28-24(14-20)19-3-4-19)17-23(18)21-15-25(31-8-11-34-12-9-31)30-26(16-21)35-13-10-32/h2,5-7,14-17,19,32H,3-4,8-13H2,1H3,(H,29,33)
US Patent
n/an/a 0.430n/an/an/an/a7.525
NOVARTIS AG
US Patent
Assay Description
Raf and biotinylated Mek, kinase dead, were combined at 2x final concentrations in assay buffer (50 mM Tris, pH 7.5, 15 mM MgCl2, 0.01% BSA and 1 mM ...
US Patent US9694016 (2017)
BindingDB Entry DOI: 10.7270/Q2MC8X6W
C-RAF
(Homo sapiens (Human))
BDBM88121
(US10245267, Example 1157 | US10709712, Example 115...)
Show SMILES Cc1ccc(NC(=O)c2ccnc(c2)C2CC2)cc1-c1cc(OCCO)nc(c1)N1CCOCC1
Show InChI InChI=1S/C27H30N4O4/c1-18-2-5-22(29-27(33)20-6-7-28-24(14-20)19-3-4-19)17-23(18)21-15-25(31-8-11-34-12-9-31)30-26(16-21)35-13-10-32/h2,5-7,14-17,19,32H,3-4,8-13H2,1H3,(H,29,33)
US Patent
n/an/a 0.0900n/an/an/an/a7.525
NOVARTIS AG
US Patent
Assay Description
Raf and biotinylated Mek, kinase dead, were combined at 2x final concentrations in assay buffer (50 mM Tris, pH 7.5, 15 mM MgCl2, 0.01% BSA and 1 mM ...
US Patent US9694016 (2017)
BindingDB Entry DOI: 10.7270/Q2MC8X6W
RAF proto-oncogene serine/threonine-protein kinase
(Homo sapiens (Human))
BDBM88121
(US10245267, Example 1157 | US10709712, Example 115...)
Show SMILES Cc1ccc(NC(=O)c2ccnc(c2)C2CC2)cc1-c1cc(OCCO)nc(c1)N1CCOCC1
Show InChI InChI=1S/C27H30N4O4/c1-18-2-5-22(29-27(33)20-6-7-28-24(14-20)19-3-4-19)17-23(18)21-15-25(31-8-11-34-12-9-31)30-26(16-21)35-13-10-32/h2,5-7,14-17,19,32H,3-4,8-13H2,1H3,(H,29,33)
NCI pathway
Reactome pathway
US Patent
n/an/a 0.0900n/an/an/an/an/an/a
NOVARTIS AG
US Patent
Assay Description
C-Raf TR refers to a truncated C-Raf protein, a Δ1-324 deletion mutant.C-Raf FL refers to the full-length C-Raf protein.Full length MEK1 with an...
US Patent US10709712 (2020)
RAF proto-oncogene serine/threonine-protein kinase
(Homo sapiens (Human))
BDBM88121
(US10245267, Example 1157 | US10709712, Example 115...)
Show SMILES Cc1ccc(NC(=O)c2ccnc(c2)C2CC2)cc1-c1cc(OCCO)nc(c1)N1CCOCC1
Show InChI InChI=1S/C27H30N4O4/c1-18-2-5-22(29-27(33)20-6-7-28-24(14-20)19-3-4-19)17-23(18)21-15-25(31-8-11-34-12-9-31)30-26(16-21)35-13-10-32/h2,5-7,14-17,19,32H,3-4,8-13H2,1H3,(H,29,33)
NCI pathway
Reactome pathway
US Patent
n/an/a 0.0900n/an/an/an/an/an/a
Bristol-Myers Squibb Company
Assay Description
Raf and biotinylated Mek, kinase dead, were combined at 2× final concentrations in assay buffer (50 mM Tris, pH 7.5, 15 mM MgCl2, 0.01% BSA and 1 mM ...
Bioorg Med Chem Lett 17: 5115-20 (2007)
BindingDB Entry DOI: 10.7270/Q2RB76WP
B-RAF V600E
(Homo sapiens (Human))
BDBM88121
(US10245267, Example 1157 | US10709712, Example 115...)
Show SMILES Cc1ccc(NC(=O)c2ccnc(c2)C2CC2)cc1-c1cc(OCCO)nc(c1)N1CCOCC1
Show InChI InChI=1S/C27H30N4O4/c1-18-2-5-22(29-27(33)20-6-7-28-24(14-20)19-3-4-19)17-23(18)21-15-25(31-8-11-34-12-9-31)30-26(16-21)35-13-10-32/h2,5-7,14-17,19,32H,3-4,8-13H2,1H3,(H,29,33)
US Patent
n/an/a 0.430n/an/an/an/an/an/a
NOVARTIS AG
US Patent
Assay Description
C-Raf TR refers to a truncated C-Raf protein, a Δ1-324 deletion mutant.C-Raf FL refers to the full-length C-Raf protein.Full length MEK1 with an...
US Patent US10709712 (2020)
B-RAF V600E
(Homo sapiens (Human))
BDBM88121
(US10245267, Example 1157 | US10709712, Example 115...)
Show SMILES Cc1ccc(NC(=O)c2ccnc(c2)C2CC2)cc1-c1cc(OCCO)nc(c1)N1CCOCC1
Show InChI InChI=1S/C27H30N4O4/c1-18-2-5-22(29-27(33)20-6-7-28-24(14-20)19-3-4-19)17-23(18)21-15-25(31-8-11-34-12-9-31)30-26(16-21)35-13-10-32/h2,5-7,14-17,19,32H,3-4,8-13H2,1H3,(H,29,33)
US Patent
n/an/a 0.430n/an/an/an/an/an/a
Bristol-Myers Squibb Company
Assay Description
Raf and biotinylated Mek, kinase dead, were combined at 2× final concentrations in assay buffer (50 mM Tris, pH 7.5, 15 mM MgCl2, 0.01% BSA and 1 mM ...
Bioorg Med Chem Lett 17: 5115-20 (2007)
BindingDB Entry DOI: 10.7270/Q2RB76WP