BDBM88829 4-[(E)-(1-butyl-2-benzimidazolyl)iminomethyl]-N,N-dimethylaniline::4-[(E)-(1-butylbenzimidazol-2-yl)iminomethyl]-N,N-dimethyl-aniline::4-[(E)-(1-butylbenzimidazol-2-yl)iminomethyl]-N,N-dimethylaniline::MLS000549030::N-(1-butyl-1H-benzimidazol-2-yl)-N-[4-(dimethylamino)benzylidene]amine::SMR000113954::[4-[(E)-(1-butylbenzimidazol-2-yl)iminomethyl]phenyl]-dimethyl-amine::cid_9634351
SMILES: CCCCn1c(\N=C\c2ccc(cc2)N(C)C)nc2ccccc12
InChI Key: InChIKey=UFDMBGHPPFXBAX-RCCKNPSSSA-N
Data: 2 IC50
Activity Spreadsheet -- Enzyme Inhibition Constant Data from BindingDB
Found 2 hits for monomerid = 88829
Trg + Lig
Ki
nM
ΔG°
kcal/mole
IC50
nM
Kd
nM
EC50/IC50
nM
koff
s-1
kon
M-1s-1
pHTemp
°C
26S Proteasome regulatory subunit Rpn11 (Rpn11)
(Homo sapiens (Human))
BDBM88829
(4-[(E)-(1-butyl-2-benzimidazolyl)iminomethyl]-N,N-...)
Show SMILES CCCCn1c(\N=C\c2ccc(cc2)N(C)C)nc2ccccc12
Show InChI InChI=1S/C20H24N4/c1-4-5-14-24-19-9-7-6-8-18(19)22-20(24)21-15-16-10-12-17(13-11-16)23(2)3/h6-13,15H,4-5,14H2,1-3H3/b21-15+
PCBioAssay
n/an/a 5.14E+3n/an/an/an/an/an/a
Burnham Center for Chemical Genomics
Curated by PubChem BioAssay
Assay Description
Data Source: Sanford-Burnham Center for Chemical Genomics (SBCCG) Source Affiliation: Sanford Burnham Medical Research Institute (SBMRI, La Jolla, CA...
PubChem Bioassay (2012)
BindingDB Entry DOI: 10.7270/Q2PC30Z9
Thrombin
(Bos taurus (Bovine))
BDBM88829
(4-[(E)-(1-butyl-2-benzimidazolyl)iminomethyl]-N,N-...)
Show SMILES CCCCn1c(\N=C\c2ccc(cc2)N(C)C)nc2ccccc12
Show InChI InChI=1S/C20H24N4/c1-4-5-14-24-19-9-7-6-8-18(19)22-20(24)21-15-16-10-12-17(13-11-16)23(2)3/h6-13,15H,4-5,14H2,1-3H3/b21-15+
PCBioAssay
n/an/a 7.12E+3n/an/an/an/an/an/a
Burnham Center for Chemical Genomics
Curated by PubChem BioAssay
Assay Description
Data Source: Sanford-Burnham Center for Chemical Genomics (SBCCG) Source Affiliation: Sanford Burnham Medical Research Institute (SBMRI, La Jolla, CA...
PubChem Bioassay (2012)
BindingDB Entry DOI: 10.7270/Q2JM286J