BDBM891 L-685,434 deriv. 39::N-(2(R)-Hydroxy-1(S)-indanyl)-5(S)-[(tert-butyloxycarbonyl)amino]-4(S)-hydroxy-6-phenyl-2(R)-[[4-[2-(1-oxothiamorpholin-4-yl)ethoxy]phenyl]methyl]hexanamide::tert-butyl N-[(2S,3S,5R)-3-hydroxy-5-{[(1S,2R)-2-hydroxy-2,3-dihydro-1H-inden-1-yl]carbamoyl}-5-({4-[2-(1-oxo-1,4-thiomorpholin-4-yl)ethoxy]phenyl}methyl)-1-phenylpentan-2-yl]carbamate
SMILES: CC(C)(C)OC(=O)N[C@@H](Cc1ccccc1)[C@@H](O)C[C@@H](Cc1ccc(OCCN2CCS(=O)CC2)cc1)C(=O)N[C@@H]1[C@H](O)Cc2ccccc12
InChI Key: InChIKey=XLZPJKXMTIWXCM-AIIVFDHXSA-N
Data: 1 IC50
Activity Spreadsheet -- Enzyme Inhibition Constant Data from BindingDB
Found 1 hit for monomerid = 891
Trg + Lig
Ki
nM
ΔG°
kcal/mole
IC50
nM
Kd
nM
EC50/IC50
nM
koff
s-1
kon
M-1s-1
pHTemp
°C
HIV-1 Protease
(Human immunodeficiency virus type 1)
BDBM891
(L-685,434 deriv. 39 | N-(2(R)-Hydroxy-1(S)-indanyl...)
Show SMILES CC(C)(C)OC(=O)N[C@@H](Cc1ccccc1)[C@@H](O)C[C@@H](Cc1ccc(OCCN2CCS(=O)CC2)cc1)C(=O)N[C@@H]1[C@H](O)Cc2ccccc12 |r|
Show InChI InChI=1S/C39H51N3O7S/c1-39(2,3)49-38(46)40-33(24-27-9-5-4-6-10-27)34(43)26-30(37(45)41-36-32-12-8-7-11-29(32)25-35(36)44)23-28-13-15-31(16-14-28)48-20-17-42-18-21-50(47)22-19-42/h4-16,30,33-36,43-44H,17-26H2,1-3H3,(H,40,46)(H,41,45)/t30-,33+,34+,35-,36+/m1/s1
n/an/a 0.0700n/an/an/an/a5.530
Merck Research Laboratories
Assay Description
Sensitivity of HIV-1 protease activity to protease inhibitors was determined by a peptide substrate cleavage assay. Protease products were analyzed o...
J Med Chem 35: 1685-701 (1992)
Article DOI: 10.1021/jm00088a003
BindingDB Entry DOI: 10.7270/Q2JH3JCF