BDBM89192 3-(diethylamino)-N-(9,10-diketo-1-anthryl)propionamide;hydrochloride::3-(diethylamino)-N-(9,10-dioxo-1-anthracenyl)propanamide;hydrochloride::3-(diethylamino)-N-(9,10-dioxoanthracen-1-yl)propanamide;hydrochloride::3-Diethylamino-N-(9,10-dioxo-9,10-dihydro-anthracen-1-yl)-propionamide::MLS001030089::N-[9,10-bis(oxidanylidene)anthracen-1-yl]-3-(diethylamino)propanamide;hydrochloride::SMR000427494::cid_188677
SMILES: CCN(CC)CCC(=O)Nc1cccc2C(=O)c3ccccc3C(=O)c12
InChI Key: InChIKey=GYKCOAYJKHCBQC-UHFFFAOYSA-N
Data: 2 IC50  1 EC50
Activity Spreadsheet -- Enzyme Inhibition Constant Data from BindingDB
Found 3 hits for monomerid = 89192
Trg + Lig
Ki
nM
ΔG°
kcal/mole
IC50
nM
Kd
nM
EC50/IC50
nM
koff
s-1
kon
M-1s-1
pHTemp
°C
DNA (cytosine-5)-methyltransferase 1
(Homo sapiens (Human))
BDBM89192
(3-(diethylamino)-N-(9,10-diketo-1-anthryl)propiona...)
Show SMILES CCN(CC)CCC(=O)Nc1cccc2C(=O)c3ccccc3C(=O)c12
Show InChI InChI=1S/C21H22N2O3/c1-3-23(4-2)13-12-18(24)22-17-11-7-10-16-19(17)21(26)15-9-6-5-8-14(15)20(16)25/h5-11H,3-4,12-13H2,1-2H3,(H,22,24)
PCBioAssay
n/an/a 6.86E+3n/an/an/an/an/an/a
Burnham Center for Chemical Genomics
Curated by PubChem BioAssay
Assay Description
Data Source: Sanford-Burnham Center for Chemical Genomics (SBCCG) Source Affiliation: Sanford-Burnham Medical Research Institute (SBMRI, San Diego, C...
PubChem Bioassay (2012)
BindingDB Entry DOI: 10.7270/Q2NC5ZRN
Methyl-CpG-binding domain protein 2
(Homo sapiens (Human))
BDBM89192
(3-(diethylamino)-N-(9,10-diketo-1-anthryl)propiona...)
Show SMILES CCN(CC)CCC(=O)Nc1cccc2C(=O)c3ccccc3C(=O)c12
Show InChI InChI=1S/C21H22N2O3/c1-3-23(4-2)13-12-18(24)22-17-11-7-10-16-19(17)21(26)15-9-6-5-8-14(15)20(16)25/h5-11H,3-4,12-13H2,1-2H3,(H,22,24)
Reactome pathway
PCBioAssay
n/an/a 7.01E+3n/an/an/an/an/an/a
The Scripps Research Institute Molecular Screening Center
Curated by PubChem BioAssay
Assay Description
Source (MLPCN Center Name): The Scripps Research Institute Molecular Screening Center Affiliation: The Scripps Research Institute, TSRI Assay Provide...
PubChem Bioassay (2013)
BindingDB Entry DOI: 10.7270/Q20K2778
Probable global transcription activator SNF2L2
(Homo sapiens (Human))
BDBM89192
(3-(diethylamino)-N-(9,10-diketo-1-anthryl)propiona...)
Show SMILES CCN(CC)CCC(=O)Nc1cccc2C(=O)c3ccccc3C(=O)c12
Show InChI InChI=1S/C21H22N2O3/c1-3-23(4-2)13-12-18(24)22-17-11-7-10-16-19(17)21(26)15-9-6-5-8-14(15)20(16)25/h5-11H,3-4,12-13H2,1-2H3,(H,22,24)
Reactome pathway
PCBioAssay
n/an/an/an/a 9.64E+3n/an/an/an/a
The Scripps Research Institute Molecular Screening Center
Curated by PubChem BioAssay
PubChem Bioassay (2013)
BindingDB Entry DOI: 10.7270/Q2GF0S4R