BDBM893 4-(2-{4-[(2R)-2-[(2S,3S)-3-{[(tert-butoxy)carbonyl]amino}-2-hydroxy-4-phenylbutyl]-2-{[(1S,2R)-2-hydroxy-2,3-dihydro-1H-inden-1-yl]carbamoyl}ethyl]phenoxy}ethyl)-4-hydroxymorpholin-4-ium::L-685,434 deriv. 41::N-(2(R)-Hydroxy-1(S)-indanyl)-5(S)-[(tert-butyloxycarbonyl)amino]-4(S)-hydroxy-6-phenyl-2(R)-[[4-[2-(4-oxo-4-morpholinyl)ethoxy]phenyl]methyl]hexanamide
SMILES: CC(C)(C)OC(=O)N[C@@H](Cc1ccccc1)[C@@H](O)C[C@@H](Cc1ccc(OCC[N+]2(O)CCOCC2)cc1)C(=O)N[C@@H]1[C@H](O)Cc2ccccc12
InChI Key: InChIKey=VHGKRXYOWQSVDY-AIIVFDHXSA-O
Data: 1 IC50
Activity Spreadsheet -- Enzyme Inhibition Constant Data from BindingDB
Found 1 hit for monomerid = 893
Trg + Lig
Ki
nM
ΔG°
kcal/mole
IC50
nM
Kd
nM
EC50/IC50
nM
koff
s-1
kon
M-1s-1
pHTemp
°C
HIV-1 Protease
(Human immunodeficiency virus type 1)
BDBM893
(4-(2-{4-[(2R)-2-[(2S,3S)-3-{[(tert-butoxy)carbonyl...)
Show SMILES CC(C)(C)OC(=O)N[C@@H](Cc1ccccc1)[C@@H](O)C[C@@H](Cc1ccc(OCC[N+]2(O)CCOCC2)cc1)C(=O)N[C@@H]1[C@H](O)Cc2ccccc12 |r|
Show InChI InChI=1S/C39H51N3O8/c1-39(2,3)50-38(46)40-33(24-27-9-5-4-6-10-27)34(43)26-30(37(45)41-36-32-12-8-7-11-29(32)25-35(36)44)23-28-13-15-31(16-14-28)49-22-19-42(47)17-20-48-21-18-42/h4-16,30,33-36,43-44,47H,17-26H2,1-3H3,(H-,40,41,45,46)/p+1/t30-,33+,34+,35-,36+/m1/s1
n/an/a 0.200n/an/an/an/a5.530
Merck Research Laboratories
Assay Description
Sensitivity of HIV-1 protease activity to protease inhibitors was determined by a peptide substrate cleavage assay. Protease products were analyzed o...
J Med Chem 35: 1685-701 (1992)
Article DOI: 10.1021/jm00088a003
BindingDB Entry DOI: 10.7270/Q2JH3JCF