BDBM89388 MLS001214642::SMR000543664::cid_16404356
SMILES: [H][C@@]12CCC3(C)OOC11C(CC[C@H]2C)C(C)C(OC(=O)CCC(=O)NC(C)CC)O[C@@]1([H])O3
InChI Key: InChIKey=LLEYTMCHSAVWTC-ODYDGNKYSA-N
Data: 4 IC50
Activity Spreadsheet -- Enzyme Inhibition Constant Data from BindingDB
Found 4 hits for monomerid = 89388
Trg + Lig
Ki
nM
ΔG°
kcal/mole
IC50
nM
Kd
nM
EC50/IC50
nM
koff
s-1
kon
M-1s-1
pHTemp
°C
Zinc finger protein GLI1
(Mus musculus)
BDBM89388
(MLS001214642 | SMR000543664 | cid_16404356)
Show SMILES [H][C@@]12CCC3(C)OOC11C(CC[C@H]2C)C(C)C(OC(=O)CCC(=O)NC(C)CC)O[C@@]1([H])O3
Show InChI InChI=1S/C23H37NO7/c1-6-14(3)24-18(25)9-10-19(26)27-20-15(4)17-8-7-13(2)16-11-12-22(5)29-21(28-20)23(16,17)31-30-22/h13-17,20-21H,6-12H2,1-5H3,(H,24,25)/t13-,14?,15?,16+,17?,20?,21+,22?,23?/m1/s1
PCBioAssay
n/an/a 421n/an/an/an/an/an/a
Burnham Center for Chemical Genomics
Curated by PubChem BioAssay
Assay Description
Data Source: Sanford-Burnham Center for Chemical Genomics (SBCCG) Source Affiliation: Sanford-Burnham Medical Research Institute (SBMRI, San Diego, C...
PubChem Bioassay (2012)
BindingDB Entry DOI: 10.7270/Q2862F26
Alpha trans-inducing protein (VP16)
(Human herpesvirus 1 (strain 17) (HHV-1) (Human her...)
BDBM89388
(MLS001214642 | SMR000543664 | cid_16404356)
Show SMILES [H][C@@]12CCC3(C)OOC11C(CC[C@H]2C)C(C)C(OC(=O)CCC(=O)NC(C)CC)O[C@@]1([H])O3
Show InChI InChI=1S/C23H37NO7/c1-6-14(3)24-18(25)9-10-19(26)27-20-15(4)17-8-7-13(2)16-11-12-22(5)29-21(28-20)23(16,17)31-30-22/h13-17,20-21H,6-12H2,1-5H3,(H,24,25)/t13-,14?,15?,16+,17?,20?,21+,22?,23?/m1/s1
PCBioAssay
n/an/a 8.54E+4n/an/an/an/an/an/a
The Scripps Research Institute Molecular Screening Center
Curated by PubChem BioAssay
Assay Description
Source (MLPCN Center Name): The Scripps Research Institute Molecular Screening Center Affiliation: The Scripps Research Institute, TSRI Assay Provide...
PubChem Bioassay (2013)
BindingDB Entry DOI: 10.7270/Q2GM85ZT
COUP transcription factor 2 isoform a
(Homo sapiens (Human))
BDBM89388
(MLS001214642 | SMR000543664 | cid_16404356)
Show SMILES [H][C@@]12CCC3(C)OOC11C(CC[C@H]2C)C(C)C(OC(=O)CCC(=O)NC(C)CC)O[C@@]1([H])O3
Show InChI InChI=1S/C23H37NO7/c1-6-14(3)24-18(25)9-10-19(26)27-20-15(4)17-8-7-13(2)16-11-12-22(5)29-21(28-20)23(16,17)31-30-22/h13-17,20-21H,6-12H2,1-5H3,(H,24,25)/t13-,14?,15?,16+,17?,20?,21+,22?,23?/m1/s1
Reactome pathway
PCBioAssay
n/an/a 4.68E+5n/an/an/an/an/an/a
The Scripps Research Institute Molecular Screening Center
Curated by PubChem BioAssay
PubChem Bioassay (2013)
BindingDB Entry DOI: 10.7270/Q21Z431S
Protein Wnt-3a
(Mus musculus)
BDBM89388
(MLS001214642 | SMR000543664 | cid_16404356)
Show SMILES [H][C@@]12CCC3(C)OOC11C(CC[C@H]2C)C(C)C(OC(=O)CCC(=O)NC(C)CC)O[C@@]1([H])O3
Show InChI InChI=1S/C23H37NO7/c1-6-14(3)24-18(25)9-10-19(26)27-20-15(4)17-8-7-13(2)16-11-12-22(5)29-21(28-20)23(16,17)31-30-22/h13-17,20-21H,6-12H2,1-5H3,(H,24,25)/t13-,14?,15?,16+,17?,20?,21+,22?,23?/m1/s1
Reactome pathway
PCBioAssay
n/an/a 238n/an/an/an/an/an/a
Burnham Center for Chemical Genomics
Curated by PubChem BioAssay
PubChem Bioassay (2012)
BindingDB Entry DOI: 10.7270/Q25B012X