BDBM89901 1-(2,4,6-Trimethyl-benzenesulfonyl)-1H-indole::1-(2,4,6-trimethylphenyl)sulfonylindole::1-mesitylsulfonylindole::MLS000550943::SMR000145071::cid_919981
SMILES: Cc1cc(C)c(c(C)c1)S(=O)(=O)n1ccc2ccccc12
InChI Key: InChIKey=JUVBNOZJBTVSBC-UHFFFAOYSA-N
Data: 1 IC50  1 EC50
Activity Spreadsheet -- Enzyme Inhibition Constant Data from BindingDB
Found 2 hits for monomerid = 89901
Trg + Lig
Ki
nM
ΔG°
kcal/mole
IC50
nM
Kd
nM
EC50/IC50
nM
koff
s-1
kon
M-1s-1
pHTemp
°C
Rap guanine nucleotide exchange factor 4
(Homo sapiens (Human))
BDBM89901
(1-(2,4,6-Trimethyl-benzenesulfonyl)-1H-indole | 1-...)
Show SMILES Cc1cc(C)c(c(C)c1)S(=O)(=O)n1ccc2ccccc12
Show InChI InChI=1S/C17H17NO2S/c1-12-10-13(2)17(14(3)11-12)21(19,20)18-9-8-15-6-4-5-7-16(15)18/h4-11H,1-3H3
Reactome pathway
n/an/a 1.20E+3n/an/an/an/an/an/a
University of Texas Medical Branch
Curated by ChEMBL
Assay Description
Antagonist activity at recombinant EPAC2 (unknown origin) assessed 8-NBD-cAMP substrate fluorescence intensity by substrate competing assay
J Med Chem 56: 952-62 (2013)
Article DOI: 10.1021/jm3014162
BindingDB Entry DOI: 10.7270/Q2D21ZX3
corticotropin releasing factor-binding protein
(Homo sapiens (Human))
BDBM89901
(1-(2,4,6-Trimethyl-benzenesulfonyl)-1H-indole | 1-...)
Show SMILES Cc1cc(C)c(c(C)c1)S(=O)(=O)n1ccc2ccccc12
Show InChI InChI=1S/C17H17NO2S/c1-12-10-13(2)17(14(3)11-12)21(19,20)18-9-8-15-6-4-5-7-16(15)18/h4-11H,1-3H3
PCBioAssay
n/an/an/an/a>5.30E+4n/an/an/an/a
Burnham Center for Chemical Genomics
Curated by PubChem BioAssay
Assay Description
Data Source: Sanford-Burnham Center for Chemical Genomics (SBCCG) Source Affiliation: Sanford-Burnham Medical Research Institute (SBMRI, San Diego, C...
PubChem Bioassay (2012)
BindingDB Entry DOI: 10.7270/Q2VX0F3D