BDBM9002 6-chloro-N-heptyl-1,2,3,4-tetrahydroacridin-9-amine::Tacrine Analogue 19
SMILES: CCCCCCCNc1c2CCCCc2nc2cc(Cl)ccc12
InChI Key: InChIKey=XUHVEOJQELBGLL-UHFFFAOYSA-N
Data: 4 IC50
PDB links: 3 PDB IDs contain inhibitors having a similarity of 90% to this monomer.
Activity Spreadsheet -- Enzyme Inhibition Constant Data from BindingDB
Found 4 hits for monomerid = 9002
Trg + Lig
Ki
nM
ΔG°
kcal/mole
IC50
nM
Kd
nM
EC50/IC50
nM
koff
s-1
kon
M-1s-1
pHTemp
°C
Acetylcholinesterase
(Homo sapiens (Human))
BDBM9002
(6-chloro-N-heptyl-1,2,3,4-tetrahydroacridin-9-amin...)
Show SMILES CCCCCCCNc1c2CCCCc2nc2cc(Cl)ccc12
Show InChI InChI=1S/C20H27ClN2/c1-2-3-4-5-8-13-22-20-16-9-6-7-10-18(16)23-19-14-15(21)11-12-17(19)20/h11-12,14H,2-10,13H2,1H3,(H,22,23)
NCI pathway
Reactome pathway
n/an/a 13n/an/an/an/a8.037
University of Bologna
Assay Description
The cholinesterase assays were performed using colorimetric method reported by Ellman. The appearance of product was monitored at 412 nm for 5 min us...
J Med Chem 43: 2007-18 (2000)
Article DOI: 10.1021/jm990971t
BindingDB Entry DOI: 10.7270/Q2057D4R
Acetylcholinesterase
(Electrophorus electricus (Electric eel))
BDBM9002
(6-chloro-N-heptyl-1,2,3,4-tetrahydroacridin-9-amin...)
Show SMILES CCCCCCCNc1c2CCCCc2nc2cc(Cl)ccc12
Show InChI InChI=1S/C20H27ClN2/c1-2-3-4-5-8-13-22-20-16-9-6-7-10-18(16)23-19-14-15(21)11-12-17(19)20/h11-12,14H,2-10,13H2,1H3,(H,22,23)
n/an/a 16n/an/an/an/an/an/a
University of Michigan
Curated by ChEMBL
Assay Description
Inhibition of electric eel AChE using acetylthiocholine as substrate preincubated for 10 mins prior to substrate addition measured every 30 seconds f...
Bioorg Med Chem 21: 3614-23 (2013)
Article DOI: 10.1016/j.bmc.2013.02.047
BindingDB Entry DOI: 10.7270/Q2WQ0557
Acetylcholinesterase
(Electrophorus electricus (Electric eel))
BDBM9002
(6-chloro-N-heptyl-1,2,3,4-tetrahydroacridin-9-amin...)
Show SMILES CCCCCCCNc1c2CCCCc2nc2cc(Cl)ccc12
Show InChI InChI=1S/C20H27ClN2/c1-2-3-4-5-8-13-22-20-16-9-6-7-10-18(16)23-19-14-15(21)11-12-17(19)20/h11-12,14H,2-10,13H2,1H3,(H,22,23)
n/an/a 2n/an/an/an/an/an/a
University of Michigan
Curated by ChEMBL
Assay Description
Inhibition of electric eel AChE preincubated for 30 mins prior to horseradish peroxidase, H2O2 and DETAPAC addition measured for 20 mins under ROS co...
Bioorg Med Chem 21: 3614-23 (2013)
Article DOI: 10.1016/j.bmc.2013.02.047
BindingDB Entry DOI: 10.7270/Q2WQ0557
Acetylcholinesterase
(Homo sapiens (Human))
BDBM9002
(6-chloro-N-heptyl-1,2,3,4-tetrahydroacridin-9-amin...)
Show SMILES CCCCCCCNc1c2CCCCc2nc2cc(Cl)ccc12
Show InChI InChI=1S/C20H27ClN2/c1-2-3-4-5-8-13-22-20-16-9-6-7-10-18(16)23-19-14-15(21)11-12-17(19)20/h11-12,14H,2-10,13H2,1H3,(H,22,23)
NCI pathway
Reactome pathway
n/an/a 13n/an/an/an/an/an/a
Sichuan University
Curated by ChEMBL
Assay Description
Inhibition of AChE
Eur J Med Chem 45: 1167-72 (2010)
Article DOI: 10.1016/j.ejmech.2009.12.038
BindingDB Entry DOI: 10.7270/Q25H7GFM