BDBM90092 MLS000332372::N-[4-(4-Methoxy-phenyl)-thiazol-2-yl]-2-(3-methylsulfanyl-[1,2,4]thiadiazol-5-ylsulfanyl)-acetamide::N-[4-(4-methoxyphenyl)-1,3-thiazol-2-yl]-2-[(3-methylsulfanyl-1,2,4-thiadiazol-5-yl)sulfanyl]acetamide::N-[4-(4-methoxyphenyl)-1,3-thiazol-2-yl]-2-[(3-methylsulfanyl-1,2,4-thiadiazol-5-yl)sulfanyl]ethanamide::N-[4-(4-methoxyphenyl)-2-thiazolyl]-2-[[3-(methylthio)-1,2,4-thiadiazol-5-yl]thio]acetamide::N-[4-(4-methoxyphenyl)thiazol-2-yl]-2-[[3-(methylthio)-1,2,4-thiadiazol-5-yl]thio]acetamide::SMR000221674::cid_1840505
SMILES: COc1ccc(cc1)-c1csc(NC(=O)CSc2nc(SC)ns2)n1
InChI Key: InChIKey=XYSDZDXBQFVHIU-UHFFFAOYSA-N
Data: 1 IC50  1 EC50
Activity Spreadsheet -- Enzyme Inhibition Constant Data from BindingDB
Found 2 hits for monomerid = 90092
Trg + Lig
Ki
nM
ΔG°
kcal/mole
IC50
nM
Kd
nM
EC50/IC50
nM
koff
s-1
kon
M-1s-1
pHTemp
°C
corticotropin releasing factor-binding protein
(Homo sapiens (Human))
BDBM90092
(MLS000332372 | N-[4-(4-Methoxy-phenyl)-thiazol-2-y...)
Show SMILES COc1ccc(cc1)-c1csc(NC(=O)CSc2nc(SC)ns2)n1
Show InChI InChI=1S/C15H14N4O2S4/c1-21-10-5-3-9(4-6-10)11-7-23-13(16-11)17-12(20)8-24-15-18-14(22-2)19-25-15/h3-7H,8H2,1-2H3,(H,16,17,20)
PCBioAssay
n/an/a 4.64E+3n/an/an/an/an/an/a
Burnham Center for Chemical Genomics
Curated by PubChem BioAssay
PubChem Bioassay (2012)
BindingDB Entry DOI: 10.7270/Q2NC5ZS3
corticotropin releasing factor-binding protein
(Homo sapiens (Human))
BDBM90092
(MLS000332372 | N-[4-(4-Methoxy-phenyl)-thiazol-2-y...)
Show SMILES COc1ccc(cc1)-c1csc(NC(=O)CSc2nc(SC)ns2)n1
Show InChI InChI=1S/C15H14N4O2S4/c1-21-10-5-3-9(4-6-10)11-7-23-13(16-11)17-12(20)8-24-15-18-14(22-2)19-25-15/h3-7H,8H2,1-2H3,(H,16,17,20)
PCBioAssay
n/an/an/an/a>5.30E+4n/an/an/an/a
Burnham Center for Chemical Genomics
Curated by PubChem BioAssay
Assay Description
Data Source: Sanford-Burnham Center for Chemical Genomics (SBCCG) Source Affiliation: Sanford-Burnham Medical Research Institute (SBMRI, San Diego, C...
PubChem Bioassay (2012)
BindingDB Entry DOI: 10.7270/Q2VX0F3D