BDBM90403 6-bromanyl-N-[1-[(2-methylphenyl)methyl]pyrazol-3-yl]pyrazolo[1,5-a]pyrimidine-2-carboxamide::6-bromo-N-[1-(2-methylbenzyl)-1H-pyrazol-3-yl]pyrazolo[1,5-a]pyrimidine-2-carboxamide::6-bromo-N-[1-(2-methylbenzyl)pyrazol-3-yl]pyrazolo[1,5-a]pyrimidine-2-carboxamide::6-bromo-N-[1-[(2-methylphenyl)methyl]-3-pyrazolyl]-2-pyrazolo[1,5-a]pyrimidinecarboxamide::6-bromo-N-[1-[(2-methylphenyl)methyl]pyrazol-3-yl]pyrazolo[1,5-a]pyrimidine-2-carboxamide::MLS000679687::SMR000296931::cid_1259129
SMILES: Cc1ccccc1Cn1ccc(NC(=O)c2cc3ncc(Br)cn3n2)n1
InChI Key: InChIKey=LPNLZUNEWVIHQV-UHFFFAOYSA-N
Data: 1 IC50  1 EC50
Activity Spreadsheet -- Enzyme Inhibition Constant Data from BindingDB
Found 2 hits for monomerid = 90403
Trg + Lig
Ki
nM
ΔG°
kcal/mole
IC50
nM
Kd
nM
EC50/IC50
nM
koff
s-1
kon
M-1s-1
pHTemp
°C
corticotropin releasing factor-binding protein
(Homo sapiens (Human))
BDBM90403
(6-bromanyl-N-[1-[(2-methylphenyl)methyl]pyrazol-3-...)
Show SMILES Cc1ccccc1Cn1ccc(NC(=O)c2cc3ncc(Br)cn3n2)n1
Show InChI InChI=1S/C18H15BrN6O/c1-12-4-2-3-5-13(12)10-24-7-6-16(23-24)21-18(26)15-8-17-20-9-14(19)11-25(17)22-15/h2-9,11H,10H2,1H3,(H,21,23,26)
PCBioAssay
n/an/a 2.65E+3n/an/an/an/an/an/a
Burnham Center for Chemical Genomics
Curated by PubChem BioAssay
PubChem Bioassay (2012)
BindingDB Entry DOI: 10.7270/Q2NC5ZS3
corticotropin releasing factor-binding protein
(Homo sapiens (Human))
BDBM90403
(6-bromanyl-N-[1-[(2-methylphenyl)methyl]pyrazol-3-...)
Show SMILES Cc1ccccc1Cn1ccc(NC(=O)c2cc3ncc(Br)cn3n2)n1
Show InChI InChI=1S/C18H15BrN6O/c1-12-4-2-3-5-13(12)10-24-7-6-16(23-24)21-18(26)15-8-17-20-9-14(19)11-25(17)22-15/h2-9,11H,10H2,1H3,(H,21,23,26)
PCBioAssay
n/an/an/an/a>5.30E+4n/an/an/an/a
Burnham Center for Chemical Genomics
Curated by PubChem BioAssay
Assay Description
Data Source: Sanford-Burnham Center for Chemical Genomics (SBCCG) Source Affiliation: Sanford-Burnham Medical Research Institute (SBMRI, San Diego, C...
PubChem Bioassay (2012)
BindingDB Entry DOI: 10.7270/Q2VX0F3D