BDBM9052 6-fluoro-N-{8-[(6-fluoro-1,2,3,4-tetrahydroacridin-9-yl)amino]octyl}-1,2,3,4-tetrahydroacridin-9-amine::Homodimeric Tacrine Analog 3f::Octylene-Linked Bis-(6-fluoro)tacrine
SMILES: Fc1ccc2c(NCCCCCCCCNc3c4CCCCc4nc4cc(F)ccc34)c3CCCCc3nc2c1
InChI Key: InChIKey=LGPLUMZTSHOAFT-UHFFFAOYSA-N
Data: 3 IC50
PDB links: 3 PDB IDs contain inhibitors having a similarity of 90% to this monomer.
Activity Spreadsheet -- Enzyme Inhibition Constant Data from BindingDB
Found 3 hits for monomerid = 9052
Trg + Lig
Ki
nM
ΔG°
kcal/mole
IC50
nM
Kd
nM
EC50/IC50
nM
koff
s-1
kon
M-1s-1
pHTemp
°C
Acetylcholinesterase
(Rattus norvegicus (rat))
BDBM9052
(6-fluoro-N-{8-[(6-fluoro-1,2,3,4-tetrahydroacridin...)
Show SMILES Fc1ccc2c(NCCCCCCCCNc3c4CCCCc4nc4cc(F)ccc34)c3CCCCc3nc2c1
Show InChI InChI=1S/C34H40F2N4/c35-23-15-17-27-31(21-23)39-29-13-7-5-11-25(29)33(27)37-19-9-3-1-2-4-10-20-38-34-26-12-6-8-14-30(26)40-32-22-24(36)16-18-28(32)34/h15-18,21-22H,1-14,19-20H2,(H,37,39)(H,38,40)
n/an/a 0.700n/an/an/an/a7.437
National Defense Medical Center
Assay Description
The cholinesterase assays were performed using colorimetric method reported by Ellman. Enzyme activity was determined by measuring the absorbance at...
J Med Chem 45: 2277-82 (2002)
Article DOI: 10.1021/jm010308g
BindingDB Entry DOI: 10.7270/Q2KW5D89
Acetylcholinesterase
(Homo sapiens (Human))
BDBM9052
(6-fluoro-N-{8-[(6-fluoro-1,2,3,4-tetrahydroacridin...)
Show SMILES Fc1ccc2c(NCCCCCCCCNc3c4CCCCc4nc4cc(F)ccc34)c3CCCCc3nc2c1
Show InChI InChI=1S/C34H40F2N4/c35-23-15-17-27-31(21-23)39-29-13-7-5-11-25(29)33(27)37-19-9-3-1-2-4-10-20-38-34-26-12-6-8-14-30(26)40-32-22-24(36)16-18-28(32)34/h15-18,21-22H,1-14,19-20H2,(H,37,39)(H,38,40)
NCI pathway
Reactome pathway
n/an/a 0.700n/an/an/an/an/an/a
Sichuan University
Curated by ChEMBL
Assay Description
Inhibition of AChE
Eur J Med Chem 45: 1167-72 (2010)
Article DOI: 10.1016/j.ejmech.2009.12.038
BindingDB Entry DOI: 10.7270/Q25H7GFM
Cholinesterases
(Homo sapiens (Human))
BDBM9052
(6-fluoro-N-{8-[(6-fluoro-1,2,3,4-tetrahydroacridin...)
Show SMILES Fc1ccc2c(NCCCCCCCCNc3c4CCCCc4nc4cc(F)ccc34)c3CCCCc3nc2c1
Show InChI InChI=1S/C34H40F2N4/c35-23-15-17-27-31(21-23)39-29-13-7-5-11-25(29)33(27)37-19-9-3-1-2-4-10-20-38-34-26-12-6-8-14-30(26)40-32-22-24(36)16-18-28(32)34/h15-18,21-22H,1-14,19-20H2,(H,37,39)(H,38,40)
Reactome pathway
n/an/a 164n/an/an/an/an/an/a
National Defense Medical Center
Assay Description
The cholinesterase assays were performed using colorimetric method reported by Ellman. Enzyme activity was determined by measuring the absorbance at...
J Med Chem 45: 2277-82 (2002)
Article DOI: 10.1021/jm010308g
BindingDB Entry DOI: 10.7270/Q2KW5D89