BDBM90655 2-(3-carbethoxy-2-phenyl-benzofuran-5-yl)oxypropionic acid;ethanol::5-(1-Carboxy-ethoxy)-2-phenyl-benzofuran-3-carboxylic acid ethyl ester::MLS000777286::SMR000413680::cid_16681773::ethanol;2-[(3-ethoxycarbonyl-2-phenyl-1-benzofuran-5-yl)oxy]propanoic acid::ethanol;2-[(3-ethoxycarbonyl-2-phenyl-5-benzofuranyl)oxy]propanoic acid
SMILES: CCOC(=O)c1c(oc2ccc(OC(C)C(O)=O)cc12)-c1ccccc1
InChI Key: InChIKey=MFKXUKSFBISLPF-UHFFFAOYSA-N
Data: 1 IC50  1 EC50
Activity Spreadsheet -- Enzyme Inhibition Constant Data from BindingDB
Found 2 hits for monomerid = 90655
Trg + Lig
Ki
nM
ΔG°
kcal/mole
IC50
nM
Kd
nM
EC50/IC50
nM
koff
s-1
kon
M-1s-1
pHTemp
°C
corticotropin releasing factor-binding protein
(Homo sapiens (Human))
BDBM90655
(2-(3-carbethoxy-2-phenyl-benzofuran-5-yl)oxypropio...)
Show SMILES CCOC(=O)c1c(oc2ccc(OC(C)C(O)=O)cc12)-c1ccccc1
Show InChI InChI=1S/C20H18O6/c1-3-24-20(23)17-15-11-14(25-12(2)19(21)22)9-10-16(15)26-18(17)13-7-5-4-6-8-13/h4-12H,3H2,1-2H3,(H,21,22)
PCBioAssay
n/an/a 340n/an/an/an/an/an/a
Burnham Center for Chemical Genomics
Curated by PubChem BioAssay
PubChem Bioassay (2012)
BindingDB Entry DOI: 10.7270/Q2NC5ZS3
corticotropin releasing factor-binding protein
(Homo sapiens (Human))
BDBM90655
(2-(3-carbethoxy-2-phenyl-benzofuran-5-yl)oxypropio...)
Show SMILES CCOC(=O)c1c(oc2ccc(OC(C)C(O)=O)cc12)-c1ccccc1
Show InChI InChI=1S/C20H18O6/c1-3-24-20(23)17-15-11-14(25-12(2)19(21)22)9-10-16(15)26-18(17)13-7-5-4-6-8-13/h4-12H,3H2,1-2H3,(H,21,22)
PCBioAssay
n/an/an/an/a>5.30E+4n/an/an/an/a
Burnham Center for Chemical Genomics
Curated by PubChem BioAssay
Assay Description
Data Source: Sanford-Burnham Center for Chemical Genomics (SBCCG) Source Affiliation: Sanford-Burnham Medical Research Institute (SBMRI, San Diego, C...
PubChem Bioassay (2012)
BindingDB Entry DOI: 10.7270/Q2VX0F3D