BDBM909 (2S)-N-[(2S,3S)-3-hydroxy-5-{[1H-indol-2-yl(3-methylphenyl)methyl]carbamoyl}-1-phenylpentan-2-yl]-2-(quinolin-2-ylformamido)butanediamide::4-Hydroxy-5-((N-2-quinaloyl-L-asparagyl)amino)-6-phenylhexanoic Acid (a-(2-indolyl)-m-methylbenzyl)amide::C-terminal inhibitor 7
SMILES: Cc1cccc(c1)C(NC(=O)CC[C@H](O)[C@H](Cc1ccccc1)NC(=O)[C@H](CC(N)=O)NC(=O)c1ccc2ccccc2n1)c1cc2ccccc2[nH]1
InChI Key: InChIKey=SDBIVKHSGIGLCQ-PENBPLSKSA-N
Data: 1 KI
Activity Spreadsheet -- Enzyme Inhibition Constant Data from BindingDB
Found 1 hit for monomerid = 909
Trg + Lig
Ki
nM
ΔG°
kcal/mole
IC50
nM
Kd
nM
EC50/IC50
nM
koff
s-1
kon
M-1s-1
pHTemp
°C
HIV-1 Protease
(Human immunodeficiency virus type 1)
BDBM909
((2S)-N-[(2S,3S)-3-hydroxy-5-{[1H-indol-2-yl(3-meth...)
Show SMILES Cc1cccc(c1)C(NC(=O)CC[C@H](O)[C@H](Cc1ccccc1)NC(=O)[C@H](CC(N)=O)NC(=O)c1ccc2ccccc2n1)c1cc2ccccc2[nH]1 |r|
Show InChI InChI=1S/C42H42N6O5/c1-26-10-9-15-30(22-26)40(35-24-29-14-6-8-17-32(29)45-35)48-39(51)21-20-37(49)34(23-27-11-3-2-4-12-27)46-42(53)36(25-38(43)50)47-41(52)33-19-18-28-13-5-7-16-31(28)44-33/h2-19,22,24,34,36-37,40,45,49H,20-21,23,25H2,1H3,(H2,43,50)(H,46,53)(H,47,52)(H,48,51)/t34-,36-,37-,40?/m0/s1
39 -10.5n/an/an/an/an/a5.537
Agouron Pharmaceuticals, Inc.
Assay Description
Protease activity was measured by continuous chromogenic assay. The chromogenic peptide His-Lys-Ala-Arg-Val-Leu- (p-NO2-Phe)-Glu-Ala-Nleu-Ser (Bache...
J Med Chem 37: 2274-84 (1994)
Article DOI: 10.1021/jm00041a005
BindingDB Entry DOI: 10.7270/Q29021XP