BDBM910 (2S)-N-[(2S,3S)-5-{[cyclohexyl(1H-indol-2-yl)methyl]carbamoyl}-3-hydroxy-1-phenylpentan-2-yl]-2-(quinolin-2-ylformamido)butanediamide::4-Hydroxy-5- ((N-2-quinaloyl-L-asparagyl)amino)-phenylhexanoic Acid (a-(2-indolyl)cyclohexylmethyl)amide::C-terminal inhibitor 8
SMILES: NC(=O)C[C@H](NC(=O)c1ccc2ccccc2n1)C(=O)N[C@@H](Cc1ccccc1)[C@@H](O)CCC(=O)NC(C1CCCCC1)c1cc2ccccc2[nH]1
InChI Key: InChIKey=XEUCNQHLDXXTQV-QLMONNNWSA-N
Data: 1 KI
Activity Spreadsheet -- Enzyme Inhibition Constant Data from BindingDB
Found 1 hit for monomerid = 910
Trg + Lig
Ki
nM
ΔG°
kcal/mole
IC50
nM
Kd
nM
EC50/IC50
nM
koff
s-1
kon
M-1s-1
pHTemp
°C
HIV-1 Protease
(Human immunodeficiency virus type 1)
BDBM910
((2S)-N-[(2S,3S)-5-{[cyclohexyl(1H-indol-2-yl)methy...)
Show SMILES NC(=O)C[C@H](NC(=O)c1ccc2ccccc2n1)C(=O)N[C@@H](Cc1ccccc1)[C@@H](O)CCC(=O)NC(C1CCCCC1)c1cc2ccccc2[nH]1 |r|
Show InChI InChI=1S/C41H46N6O5/c42-37(49)25-35(46-40(51)32-20-19-27-13-7-9-17-30(27)43-32)41(52)45-33(23-26-11-3-1-4-12-26)36(48)21-22-38(50)47-39(28-14-5-2-6-15-28)34-24-29-16-8-10-18-31(29)44-34/h1,3-4,7-13,16-20,24,28,33,35-36,39,44,48H,2,5-6,14-15,21-23,25H2,(H2,42,49)(H,45,52)(H,46,51)(H,47,50)/t33-,35-,36-,39?/m0/s1
180 -9.56n/an/an/an/an/a5.537
Agouron Pharmaceuticals, Inc.
Assay Description
Protease activity was measured by continuous chromogenic assay. The chromogenic peptide His-Lys-Ala-Arg-Val-Leu- (p-NO2-Phe)-Glu-Ala-Nleu-Ser (Bache...
J Med Chem 37: 2274-84 (1994)
Article DOI: 10.1021/jm00041a005
BindingDB Entry DOI: 10.7270/Q29021XP