BDBM9112 (2S)-4-{2-[5-(4-chlorophenyl)-1,3-oxazol-2-yl]propan-2-yl}-1-[(2S,4S)-2-hydroxy-4-{[(3S,4S)-3-hydroxy-3,4-dihydro-2H-1-benzopyran-4-yl]carbamoyl}-4-[(5-phenyl-1,3,4-oxadiazol-2-yl)methyl]butyl]-N-(2,2,2-trifluoroethyl)piperazine-2-carboxamide::1,3,4-oxadiazole analog 20
SMILES: CC(C)(N1CCN(C[C@@H](O)C[C@@H](Cc2nnc(o2)-c2ccccc2)C(=O)N[C@@H]2[C@H](O)COc3ccccc23)[C@@H](C1)C(=O)NCC(F)(F)F)c1ncc(o1)-c1ccc(Cl)cc1
InChI Key: InChIKey=DAWKVXFWVFORRU-RCFHZIHPSA-N
Data: 2 IC50
Activity Spreadsheet -- Enzyme Inhibition Constant Data from BindingDB
Found 2 hits for monomerid = 9112
Trg + Lig
Ki
nM
ΔG°
kcal/mole
IC50
nM
Kd
nM
EC50/IC50
nM
koff
s-1
kon
M-1s-1
pHTemp
°C
HIV-1 Protease Mutant V-18C
(Human immunodeficiency virus type 1)
BDBM9112
((2S)-4-{2-[5-(4-chlorophenyl)-1,3-oxazol-2-yl]prop...)
Show SMILES CC(C)(N1CCN(C[C@@H](O)C[C@@H](Cc2nnc(o2)-c2ccccc2)C(=O)N[C@@H]2[C@H](O)COc3ccccc23)[C@@H](C1)C(=O)NCC(F)(F)F)c1ncc(o1)-c1ccc(Cl)cc1 |r|
Show InChI InChI=1S/C42H45ClF3N7O7/c1-41(2,40-47-20-34(59-40)25-12-14-28(43)15-13-25)53-17-16-52(31(22-53)38(57)48-24-42(44,45)46)21-29(54)18-27(19-35-50-51-39(60-35)26-8-4-3-5-9-26)37(56)49-36-30-10-6-7-11-33(30)58-23-32(36)55/h3-15,20,27,29,31-32,36,54-55H,16-19,21-24H2,1-2H3,(H,48,57)(H,49,56)/t27-,29-,31-,32+,36-/m0/s1
n/an/a 0.180n/an/an/an/an/an/a
Merck Research Laboratories
Assay Description
Assay of HIV protease inhibition was performed by peptide cleavage using the substrate Val-Ser-Gln-Asn-beta-naphthylalanine*Pro-Ile-Val. Products of ...
Bioorg Med Chem Lett 14: 4651-4 (2004)
Article DOI: 10.1016/j.bmcl.2004.06.092
BindingDB Entry DOI: 10.7270/Q22Z13QX
HIV-1 Protease
(Human immunodeficiency virus type 1)
BDBM9112
((2S)-4-{2-[5-(4-chlorophenyl)-1,3-oxazol-2-yl]prop...)
Show SMILES CC(C)(N1CCN(C[C@@H](O)C[C@@H](Cc2nnc(o2)-c2ccccc2)C(=O)N[C@@H]2[C@H](O)COc3ccccc23)[C@@H](C1)C(=O)NCC(F)(F)F)c1ncc(o1)-c1ccc(Cl)cc1 |r|
Show InChI InChI=1S/C42H45ClF3N7O7/c1-41(2,40-47-20-34(59-40)25-12-14-28(43)15-13-25)53-17-16-52(31(22-53)38(57)48-24-42(44,45)46)21-29(54)18-27(19-35-50-51-39(60-35)26-8-4-3-5-9-26)37(56)49-36-30-10-6-7-11-33(30)58-23-32(36)55/h3-15,20,27,29,31-32,36,54-55H,16-19,21-24H2,1-2H3,(H,48,57)(H,49,56)/t27-,29-,31-,32+,36-/m0/s1
n/an/a<0.0150n/an/an/an/a5.530
Merck Research Laboratories
Assay Description
Assay of HIV protease inhibition was performed by peptide cleavage using the substrate Val-Ser-Gln-Asn-beta-naphthylalanine*Pro-Ile-Val. Products of ...
Bioorg Med Chem Lett 14: 4651-4 (2004)
Article DOI: 10.1016/j.bmcl.2004.06.092
BindingDB Entry DOI: 10.7270/Q22Z13QX