BDBM9121 (2S)-1-[(2S,4R)-2-hydroxy-4-{[(3S,4S)-3-hydroxy-3,4-dihydro-2H-1-benzopyran-4-yl]carbamoyl}-4-(pyridin-3-ylmethyl)butyl]-4-[(5-phenylfuran-2-yl)methyl]-N-(2,2,2-trifluoroethyl)piperazine-2-carboxamide::furanyl analog 2
SMILES: O[C@@H](C[C@@H](Cc1cccnc1)C(=O)N[C@@H]1[C@H](O)COc2ccccc12)CN1CCN(Cc2ccc(o2)-c2ccccc2)C[C@H]1C(=O)NCC(F)(F)F
InChI Key: InChIKey=VCNRITFCECGWNQ-WZXFIOQESA-N
Data: 4 IC50
Activity Spreadsheet -- Enzyme Inhibition Constant Data from BindingDB
Found 4 hits for monomerid = 9121
Trg + Lig
Ki
nM
ΔG°
kcal/mole
IC50
nM
Kd
nM
EC50/IC50
nM
koff
s-1
kon
M-1s-1
pHTemp
°C
HIV-1 Protease
(Human immunodeficiency virus type 1)
BDBM9121
((2S)-1-[(2S,4R)-2-hydroxy-4-{[(3S,4S)-3-hydroxy-3,...)
Show SMILES O[C@@H](C[C@@H](Cc1cccnc1)C(=O)N[C@@H]1[C@H](O)COc2ccccc12)CN1CCN(Cc2ccc(o2)-c2ccccc2)C[C@H]1C(=O)NCC(F)(F)F |r|
Show InChI InChI=1S/C38H42F3N5O6/c39-38(40,41)24-43-37(50)31-22-45(21-29-12-13-33(52-29)26-8-2-1-3-9-26)15-16-46(31)20-28(47)18-27(17-25-7-6-14-42-19-25)36(49)44-35-30-10-4-5-11-34(30)51-23-32(35)48/h1-14,19,27-28,31-32,35,47-48H,15-18,20-24H2,(H,43,50)(H,44,49)/t27-,28+,31+,32-,35+/m1/s1
n/an/a 0.0200n/an/an/an/a5.530
Merck Research Laboratories
Assay Description
Assay of HIV protease inhibition was performed by peptide cleavage using the substrate Val-Ser-Gln-Asn-beta-naphthylalanine*Pro-Ile-Val. Products of ...
Bioorg Med Chem Lett 13: 4027-30 (2003)
Article DOI: 10.1016/j.bmcl.2003.08.049
BindingDB Entry DOI: 10.7270/Q2Z60M7Z
HIV-1 Protease Mutant Q-60C
(Human immunodeficiency virus type 1)
BDBM9121
((2S)-1-[(2S,4R)-2-hydroxy-4-{[(3S,4S)-3-hydroxy-3,...)
Show SMILES O[C@@H](C[C@@H](Cc1cccnc1)C(=O)N[C@@H]1[C@H](O)COc2ccccc12)CN1CCN(Cc2ccc(o2)-c2ccccc2)C[C@H]1C(=O)NCC(F)(F)F |r|
Show InChI InChI=1S/C38H42F3N5O6/c39-38(40,41)24-43-37(50)31-22-45(21-29-12-13-33(52-29)26-8-2-1-3-9-26)15-16-46(31)20-28(47)18-27(17-25-7-6-14-42-19-25)36(49)44-35-30-10-4-5-11-34(30)51-23-32(35)48/h1-14,19,27-28,31-32,35,47-48H,15-18,20-24H2,(H,43,50)(H,44,49)/t27-,28+,31+,32-,35+/m1/s1
n/an/a 0.0700n/an/an/an/an/an/a
Merck Research Laboratories
Assay Description
Assay of HIV protease inhibition was performed by peptide cleavage using the substrate Val-Ser-Gln-Asn-beta-naphthylalanine*Pro-Ile-Val. Products of ...
Bioorg Med Chem Lett 13: 4027-30 (2003)
Article DOI: 10.1016/j.bmcl.2003.08.049
BindingDB Entry DOI: 10.7270/Q2Z60M7Z
HIV-1 Protease Mutant V-18C
(Human immunodeficiency virus type 1)
BDBM9121
((2S)-1-[(2S,4R)-2-hydroxy-4-{[(3S,4S)-3-hydroxy-3,...)
Show SMILES O[C@@H](C[C@@H](Cc1cccnc1)C(=O)N[C@@H]1[C@H](O)COc2ccccc12)CN1CCN(Cc2ccc(o2)-c2ccccc2)C[C@H]1C(=O)NCC(F)(F)F |r|
Show InChI InChI=1S/C38H42F3N5O6/c39-38(40,41)24-43-37(50)31-22-45(21-29-12-13-33(52-29)26-8-2-1-3-9-26)15-16-46(31)20-28(47)18-27(17-25-7-6-14-42-19-25)36(49)44-35-30-10-4-5-11-34(30)51-23-32(35)48/h1-14,19,27-28,31-32,35,47-48H,15-18,20-24H2,(H,43,50)(H,44,49)/t27-,28+,31+,32-,35+/m1/s1
n/an/a 0.150n/an/an/an/an/an/a
Merck Research Laboratories
Assay Description
Assay of HIV protease inhibition was performed by peptide cleavage using the substrate Val-Ser-Gln-Asn-beta-naphthylalanine*Pro-Ile-Val. Products of ...
Bioorg Med Chem Lett 13: 4027-30 (2003)
Article DOI: 10.1016/j.bmcl.2003.08.049
BindingDB Entry DOI: 10.7270/Q2Z60M7Z
HIV-1 Protease Mutant K-60C
(Human immunodeficiency virus type 1)
BDBM9121
((2S)-1-[(2S,4R)-2-hydroxy-4-{[(3S,4S)-3-hydroxy-3,...)
Show SMILES O[C@@H](C[C@@H](Cc1cccnc1)C(=O)N[C@@H]1[C@H](O)COc2ccccc12)CN1CCN(Cc2ccc(o2)-c2ccccc2)C[C@H]1C(=O)NCC(F)(F)F |r|
Show InChI InChI=1S/C38H42F3N5O6/c39-38(40,41)24-43-37(50)31-22-45(21-29-12-13-33(52-29)26-8-2-1-3-9-26)15-16-46(31)20-28(47)18-27(17-25-7-6-14-42-19-25)36(49)44-35-30-10-4-5-11-34(30)51-23-32(35)48/h1-14,19,27-28,31-32,35,47-48H,15-18,20-24H2,(H,43,50)(H,44,49)/t27-,28+,31+,32-,35+/m1/s1
n/an/a 0.0600n/an/an/an/an/an/a
Merck Research Laboratories
Assay Description
Assay of HIV protease inhibition was performed by peptide cleavage using the substrate Val-Ser-Gln-Asn-beta-naphthylalanine*Pro-Ile-Val. Products of ...
Bioorg Med Chem Lett 13: 4027-30 (2003)
Article DOI: 10.1016/j.bmcl.2003.08.049
BindingDB Entry DOI: 10.7270/Q2Z60M7Z