BDBM91446 (4-chlorophenyl)-picryl-amine::MLS002920666::N-(4-chlorophenyl)-2,4,6-trinitro-aniline::N-(4-chlorophenyl)-2,4,6-trinitroaniline::SMR001798253::cid_291920
SMILES: [O-][N+](=O)c1cc(c(Nc2ccc(Cl)cc2)c(c1)[N+]([O-])=O)[N+]([O-])=O
InChI Key: InChIKey=BVQWERYAWIDLFA-UHFFFAOYSA-N
Data: 2 IC50  1 EC50
Activity Spreadsheet -- Enzyme Inhibition Constant Data from BindingDB
Found 3 hits for monomerid = 91446
Trg + Lig
Ki
nM
ΔG°
kcal/mole
IC50
nM
Kd
nM
EC50/IC50
nM
koff
s-1
kon
M-1s-1
pHTemp
°C
corticotropin releasing factor-binding protein
(Homo sapiens (Human))
BDBM91446
((4-chlorophenyl)-picryl-amine | MLS002920666 | N-(...)
Show SMILES [O-][N+](=O)c1cc(c(Nc2ccc(Cl)cc2)c(c1)[N+]([O-])=O)[N+]([O-])=O
Show InChI InChI=1S/C12H7ClN4O6/c13-7-1-3-8(4-2-7)14-12-10(16(20)21)5-9(15(18)19)6-11(12)17(22)23/h1-6,14H
PCBioAssay
n/an/an/an/a>5.30E+4n/an/an/an/a
Burnham Center for Chemical Genomics
Curated by PubChem BioAssay
Assay Description
Data Source: Sanford-Burnham Center for Chemical Genomics (SBCCG) Source Affiliation: Sanford-Burnham Medical Research Institute (SBMRI, San Diego, C...
PubChem Bioassay (2012)
BindingDB Entry DOI: 10.7270/Q2VX0F3D
Galanin receptor 3
(Homo sapiens (Human))
BDBM91446
((4-chlorophenyl)-picryl-amine | MLS002920666 | N-(...)
Show SMILES [O-][N+](=O)c1cc(c(Nc2ccc(Cl)cc2)c(c1)[N+]([O-])=O)[N+]([O-])=O
Show InChI InChI=1S/C12H7ClN4O6/c13-7-1-3-8(4-2-7)14-12-10(16(20)21)5-9(15(18)19)6-11(12)17(22)23/h1-6,14H
Reactome pathway
PCBioAssay
n/an/a>1.11E+3n/an/an/an/an/an/a
The Scripps Research Institute Molecular Screening Center
Curated by PubChem BioAssay
PubChem Bioassay (2013)
BindingDB Entry DOI: 10.7270/Q270802Q
corticotropin releasing factor-binding protein
(Homo sapiens (Human))
BDBM91446
((4-chlorophenyl)-picryl-amine | MLS002920666 | N-(...)
Show SMILES [O-][N+](=O)c1cc(c(Nc2ccc(Cl)cc2)c(c1)[N+]([O-])=O)[N+]([O-])=O
Show InChI InChI=1S/C12H7ClN4O6/c13-7-1-3-8(4-2-7)14-12-10(16(20)21)5-9(15(18)19)6-11(12)17(22)23/h1-6,14H
PCBioAssay
n/an/a 1.58E+3n/an/an/an/an/an/a
Burnham Center for Chemical Genomics
Curated by PubChem BioAssay
PubChem Bioassay (2012)
BindingDB Entry DOI: 10.7270/Q2NC5ZS3