BDBM9156 (2S)-1-[(2S,4R)-2-hydroxy-4-{[(3S,4S)-3-hydroxy-3,4-dihydro-2H-1-benzopyran-4-yl]carbamoyl}-4-(pyridin-4-ylmethyl)butyl]-4-{thieno[2,3-b]thiophen-2-ylmethyl}-N-(2,2,2-trifluoroethyl)piperazine-2-carboxamide::P3 thienothiophene analog 6
SMILES: O[C@@H](C[C@@H](Cc1ccncc1)C(=O)N[C@@H]1[C@H](O)COc2ccccc12)CN1CCN(Cc2cc3ccsc3s2)C[C@H]1C(=O)NCC(F)(F)F
InChI Key: InChIKey=OTKFZFXRIJVYCK-FZHRAUBBSA-N
Data: 4 IC50
Activity Spreadsheet -- Enzyme Inhibition Constant Data from BindingDB
Found 4 hits for monomerid = 9156
Trg + Lig
Ki
nM
ΔG°
kcal/mole
IC50
nM
Kd
nM
EC50/IC50
nM
koff
s-1
kon
M-1s-1
pHTemp
°C
HIV-1 Protease
(Human immunodeficiency virus type 1)
BDBM9156
((2S)-1-[(2S,4R)-2-hydroxy-4-{[(3S,4S)-3-hydroxy-3,...)
Show SMILES O[C@@H](C[C@@H](Cc1ccncc1)C(=O)N[C@@H]1[C@H](O)COc2ccccc12)CN1CCN(Cc2cc3ccsc3s2)C[C@H]1C(=O)NCC(F)(F)F |r|
Show InChI InChI=1S/C34H38F3N5O5S2/c35-34(36,37)20-39-32(46)27-18-41(17-25-15-22-7-12-48-33(22)49-25)10-11-42(27)16-24(43)14-23(13-21-5-8-38-9-6-21)31(45)40-30-26-3-1-2-4-29(26)47-19-28(30)44/h1-9,12,15,23-24,27-28,30,43-44H,10-11,13-14,16-20H2,(H,39,46)(H,40,45)/t23-,24+,27+,28-,30+/m1/s1
n/an/a 0.0700n/an/an/an/a5.530
Merck Research Laboratories
Assay Description
Assay of HIV protease inhibition was performed by peptide cleavage using the substrate Val-Ser-Gln-Asn-beta-naphthylalanine*Pro-Ile-Val. Products of ...
Bioorg Med Chem Lett 13: 3323-6 (2003)
Article DOI: 10.1016/s0960-894x(03)00680-2
BindingDB Entry DOI: 10.7270/Q2K072GN
HIV-1 Protease Mutant Q-60C
(Human immunodeficiency virus type 1)
BDBM9156
((2S)-1-[(2S,4R)-2-hydroxy-4-{[(3S,4S)-3-hydroxy-3,...)
Show SMILES O[C@@H](C[C@@H](Cc1ccncc1)C(=O)N[C@@H]1[C@H](O)COc2ccccc12)CN1CCN(Cc2cc3ccsc3s2)C[C@H]1C(=O)NCC(F)(F)F |r|
Show InChI InChI=1S/C34H38F3N5O5S2/c35-34(36,37)20-39-32(46)27-18-41(17-25-15-22-7-12-48-33(22)49-25)10-11-42(27)16-24(43)14-23(13-21-5-8-38-9-6-21)31(45)40-30-26-3-1-2-4-29(26)47-19-28(30)44/h1-9,12,15,23-24,27-28,30,43-44H,10-11,13-14,16-20H2,(H,39,46)(H,40,45)/t23-,24+,27+,28-,30+/m1/s1
n/an/a 4.80n/an/an/an/an/an/a
Merck Research Laboratories
Assay Description
Assay of HIV protease inhibition was performed by peptide cleavage using the substrate Val-Ser-Gln-Asn-beta-naphthylalanine*Pro-Ile-Val. Products of ...
Bioorg Med Chem Lett 13: 3323-6 (2003)
Article DOI: 10.1016/s0960-894x(03)00680-2
BindingDB Entry DOI: 10.7270/Q2K072GN
HIV-1 Protease Mutant V-18C
(Human immunodeficiency virus type 1)
BDBM9156
((2S)-1-[(2S,4R)-2-hydroxy-4-{[(3S,4S)-3-hydroxy-3,...)
Show SMILES O[C@@H](C[C@@H](Cc1ccncc1)C(=O)N[C@@H]1[C@H](O)COc2ccccc12)CN1CCN(Cc2cc3ccsc3s2)C[C@H]1C(=O)NCC(F)(F)F |r|
Show InChI InChI=1S/C34H38F3N5O5S2/c35-34(36,37)20-39-32(46)27-18-41(17-25-15-22-7-12-48-33(22)49-25)10-11-42(27)16-24(43)14-23(13-21-5-8-38-9-6-21)31(45)40-30-26-3-1-2-4-29(26)47-19-28(30)44/h1-9,12,15,23-24,27-28,30,43-44H,10-11,13-14,16-20H2,(H,39,46)(H,40,45)/t23-,24+,27+,28-,30+/m1/s1
n/an/a 1.20n/an/an/an/an/an/a
Merck Research Laboratories
Assay Description
Assay of HIV protease inhibition was performed by peptide cleavage using the substrate Val-Ser-Gln-Asn-beta-naphthylalanine*Pro-Ile-Val. Products of ...
Bioorg Med Chem Lett 13: 3323-6 (2003)
Article DOI: 10.1016/s0960-894x(03)00680-2
BindingDB Entry DOI: 10.7270/Q2K072GN
HIV-1 Protease Mutant K-60C
(Human immunodeficiency virus type 1)
BDBM9156
((2S)-1-[(2S,4R)-2-hydroxy-4-{[(3S,4S)-3-hydroxy-3,...)
Show SMILES O[C@@H](C[C@@H](Cc1ccncc1)C(=O)N[C@@H]1[C@H](O)COc2ccccc12)CN1CCN(Cc2cc3ccsc3s2)C[C@H]1C(=O)NCC(F)(F)F |r|
Show InChI InChI=1S/C34H38F3N5O5S2/c35-34(36,37)20-39-32(46)27-18-41(17-25-15-22-7-12-48-33(22)49-25)10-11-42(27)16-24(43)14-23(13-21-5-8-38-9-6-21)31(45)40-30-26-3-1-2-4-29(26)47-19-28(30)44/h1-9,12,15,23-24,27-28,30,43-44H,10-11,13-14,16-20H2,(H,39,46)(H,40,45)/t23-,24+,27+,28-,30+/m1/s1
n/an/a 20n/an/an/an/an/an/a
Merck Research Laboratories
Assay Description
Assay of HIV protease inhibition was performed by peptide cleavage using the substrate Val-Ser-Gln-Asn-beta-naphthylalanine*Pro-Ile-Val. Products of ...
Bioorg Med Chem Lett 13: 3323-6 (2003)
Article DOI: 10.1016/s0960-894x(03)00680-2
BindingDB Entry DOI: 10.7270/Q2K072GN