BDBM91580 Thiaindanone, 2
SMILES: Fc1ccccc1CN1CCN(CC(=O)NC2CC(=O)c3c(Br)sc(Br)c23)CC1
InChI Key: InChIKey=RMXOVLSQWVGRST-UHFFFAOYSA-N
Data: 1 IC50
Activity Spreadsheet -- Enzyme Inhibition Constant Data from BindingDB
Found 1 hit for monomerid = 91580
Trg + Lig
Ki
nM
ΔG°
kcal/mole
IC50
nM
Kd
nM
EC50/IC50
nM
koff
s-1
kon
M-1s-1
pHTemp
°C
Acetylcholinesterase
(Tetronarce californica (Pacific electric ray) (Tor...)
BDBM91580
(Thiaindanone, 2)
Show SMILES Fc1ccccc1CN1CCN(CC(=O)NC2CC(=O)c3c(Br)sc(Br)c23)CC1
Show InChI InChI=1S/C20H20Br2FN3O2S/c21-19-17-14(9-15(27)18(17)20(22)29-19)24-16(28)11-26-7-5-25(6-8-26)10-12-3-1-2-4-13(12)23/h1-4,14H,5-11H2,(H,24,28)
n/an/a 400n/an/an/an/a7.4n/a
Centre d'Etudes et de Recherche sur le Médicament de Normandie
Assay Description
Inhibitory ability of compounds on AChE activity was evaluated through the use of the spectrometic method of Ellman. Lyophilized electric eel AChE (...
J Enzyme Inhib Med Chem 23: 696-703 (2008)
Article DOI: 10.1080/14756360802208053
BindingDB Entry DOI: 10.7270/Q2SX6BT7