BDBM91588 Thiaindanone, 16
SMILES: Brc1sc(Br)c2C(=O)CC(NC(=O)CCCCCCc3ccccc3)c12
InChI Key: InChIKey=CUBRYBNHQVIIQF-UHFFFAOYSA-N
Data: 1 IC50
Activity Spreadsheet -- Enzyme Inhibition Constant Data from BindingDB
Found 1 hit for monomerid = 91588
Trg + Lig
Ki
nM
ΔG°
kcal/mole
IC50
nM
Kd
nM
EC50/IC50
nM
koff
s-1
kon
M-1s-1
pHTemp
°C
Acetylcholinesterase
(Tetronarce californica (Pacific electric ray) (Tor...)
BDBM91588
(Thiaindanone, 16)
Show SMILES Brc1sc(Br)c2C(=O)CC(NC(=O)CCCCCCc3ccccc3)c12
Show InChI InChI=1S/C20H21Br2NO2S/c21-19-17-14(12-15(24)18(17)20(22)26-19)23-16(25)11-7-2-1-4-8-13-9-5-3-6-10-13/h3,5-6,9-10,14H,1-2,4,7-8,11-12H2,(H,23,25)
n/an/a>5.00E+3n/an/an/an/a7.4n/a
Centre d'Etudes et de Recherche sur le Médicament de Normandie
Assay Description
Inhibitory ability of compounds on AChE activity was evaluated through the use of the spectrometic method of Ellman. Lyophilized electric eel AChE (...
J Enzyme Inhib Med Chem 23: 696-703 (2008)
Article DOI: 10.1080/14756360802208053
BindingDB Entry DOI: 10.7270/Q2SX6BT7