BDBM91591 Mormin, 1
SMILES: C\C(CO)=C/Cc1c(oc2c3C=CC(C)(CO)Oc3cc(O)c2c1=O)-c1ccc(O)cc1O
InChI Key: InChIKey=KUZOHQFKZOINRC-QLKAYGNNSA-N
Data: 1 KI  2 IC50
Activity Spreadsheet -- Enzyme Inhibition Constant Data from BindingDB
Found 3 hits for monomerid = 91591
Trg + Lig
Ki
nM
ΔG°
kcal/mole
IC50
nM
Kd
nM
EC50/IC50
nM
koff
s-1
kon
M-1s-1
pHTemp
°C
Tyrosinase
(Agaricus bisporus (Common mushroom))
BDBM91591
(Mormin, 1)
Show SMILES C\C(CO)=C/Cc1c(oc2c3C=CC(C)(CO)Oc3cc(O)c2c1=O)-c1ccc(O)cc1O |c:11|
Show InChI InChI=1S/C25H24O8/c1-13(11-26)3-5-17-22(31)21-19(30)10-20-16(7-8-25(2,12-27)33-20)24(21)32-23(17)15-6-4-14(28)9-18(15)29/h3-4,6-10,26-30H,5,11-12H2,1-2H3/b13-3+
49.2 -10.1n/an/an/an/an/an/a30
Gyeongsang National University
Assay Description
Mushroom tyrosinase using either L-DOPA or L-tyrosine as substrate. In spectrophotometric experiments, enzyme activity was monitored by dopachrome f...
J Enzyme Inhib Med Chem 23: 922-30 (2008)
Article DOI: 10.1080/14756360701810207
BindingDB Entry DOI: 10.7270/Q2P849G3
Tyrosinase
(Agaricus bisporus (Common mushroom))
BDBM91591
(Mormin, 1)
Show SMILES C\C(CO)=C/Cc1c(oc2c3C=CC(C)(CO)Oc3cc(O)c2c1=O)-c1ccc(O)cc1O |c:11|
Show InChI InChI=1S/C25H24O8/c1-13(11-26)3-5-17-22(31)21-19(30)10-20-16(7-8-25(2,12-27)33-20)24(21)32-23(17)15-6-4-14(28)9-18(15)29/h3-4,6-10,26-30H,5,11-12H2,1-2H3/b13-3+
n/an/a 8.78E+4n/an/an/an/an/a30
Gyeongsang National University
Assay Description
Mushroom tyrosinase using either L-DOPA or L-tyrosine as substrate. In spectrophotometric experiments, enzyme activity was monitored by dopachrome f...
J Enzyme Inhib Med Chem 23: 922-30 (2008)
Article DOI: 10.1080/14756360701810207
BindingDB Entry DOI: 10.7270/Q2P849G3
Tyrosinase
(Agaricus bisporus (Common mushroom))
BDBM91591
(Mormin, 1)
Show SMILES C\C(CO)=C/Cc1c(oc2c3C=CC(C)(CO)Oc3cc(O)c2c1=O)-c1ccc(O)cc1O |c:11|
Show InChI InChI=1S/C25H24O8/c1-13(11-26)3-5-17-22(31)21-19(30)10-20-16(7-8-25(2,12-27)33-20)24(21)32-23(17)15-6-4-14(28)9-18(15)29/h3-4,6-10,26-30H,5,11-12H2,1-2H3/b13-3+
n/an/a 2.15E+5n/an/an/an/an/a30
Gyeongsang National University
Assay Description
Mushroom tyrosinase using either L-DOPA or L-tyrosine as substrate. In spectrophotometric experiments, enzyme activity was monitored by dopachrome f...
J Enzyme Inhib Med Chem 23: 922-30 (2008)
Article DOI: 10.1080/14756360701810207
BindingDB Entry DOI: 10.7270/Q2P849G3