BDBM9165 N-alkoxysulfonamide analog 5::N-alkoxysulfonamide analog entry e::tert-butyl N-[(2S,3R)-4-[(cyclopentyloxy)(4-methoxybenzene)sulfonamido]-3-hydroxy-1-phenylbutan-2-yl]carbamate
SMILES: COc1ccc(cc1)S(=O)(=O)N(C[C@@H](O)[C@H](Cc1ccccc1)NC(=O)OC(C)(C)C)OC1CCCC1
InChI Key: InChIKey=XBQGRVOIPHJWJN-LOSJGSFVSA-N
Data: 1 KI
Activity Spreadsheet -- Enzyme Inhibition Constant Data from BindingDB
Found 1 hit for monomerid = 9165
Trg + Lig
Ki
nM
ΔG°
kcal/mole
IC50
nM
Kd
nM
EC50/IC50
nM
koff
s-1
kon
M-1s-1
pHTemp
°C
HIV-1 Protease
(Human immunodeficiency virus type 1)
BDBM9165
(N-alkoxysulfonamide analog 5 | N-alkoxysulfonamide...)
Show SMILES COc1ccc(cc1)S(=O)(=O)N(C[C@@H](O)[C@H](Cc1ccccc1)NC(=O)OC(C)(C)C)OC1CCCC1 |r|
Show InChI InChI=1S/C27H38N2O7S/c1-27(2,3)35-26(31)28-24(18-20-10-6-5-7-11-20)25(30)19-29(36-22-12-8-9-13-22)37(32,33)23-16-14-21(34-4)15-17-23/h5-7,10-11,14-17,22,24-25,30H,8-9,12-13,18-19H2,1-4H3,(H,28,31)/t24-,25+/m0/s1
1.60 -12.0n/an/an/an/an/a6.825
GlaxoSmithKline
Assay Description
The Ki values were determined using fluorogenic substrate, 2-(aminobenzoyl)-Thr-Ile-Nle-Phe(p-NO2)-Gln-ArgNH2. A standard curve relating changes in f...
Bioorg Med Chem Lett 15: 3560-4 (2005)
Article DOI: 10.1016/j.bmcl.2005.05.101
BindingDB Entry DOI: 10.7270/Q2F769SC