BDBM9169 N-alkoxysulfonamide analog 9::N-alkoxysulfonamide analog entry i::methyl N-[(1S)-1-{[(2S,3R)-4-[(cyclopentyloxy)(4-methoxybenzene)sulfonamido]-3-hydroxy-1-phenylbutan-2-yl]carbamoyl}-2,2-dimethylpropyl]carbamate
SMILES: COC(=O)N[C@H](C(=O)N[C@@H](Cc1ccccc1)[C@H](O)CN(OC1CCCC1)S(=O)(=O)c1ccc(OC)cc1)C(C)(C)C
InChI Key: InChIKey=VMXVHXSZACZJHA-OYUWMTPXSA-N
Data: 1 KI  1 IC50
Activity Spreadsheet -- Enzyme Inhibition Constant Data from BindingDB
Found 1 hit for monomerid = 9169
Trg + Lig
Ki
nM
ΔG°
kcal/mole
IC50
nM
Kd
nM
EC50/IC50
nM
koff
s-1
kon
M-1s-1
pHTemp
°C
HIV-1 Protease
(Human immunodeficiency virus type 1)
BDBM9169
(N-alkoxysulfonamide analog 9 | N-alkoxysulfonamide...)
Show SMILES COC(=O)N[C@H](C(=O)N[C@@H](Cc1ccccc1)[C@H](O)CN(OC1CCCC1)S(=O)(=O)c1ccc(OC)cc1)C(C)(C)C |r|
Show InChI InChI=1S/C30H43N3O8S/c1-30(2,3)27(32-29(36)40-5)28(35)31-25(19-21-11-7-6-8-12-21)26(34)20-33(41-23-13-9-10-14-23)42(37,38)24-17-15-22(39-4)16-18-24/h6-8,11-12,15-18,23,25-27,34H,9-10,13-14,19-20H2,1-5H3,(H,31,35)(H,32,36)/t25-,26+,27+/m0/s1
0.0900 -13.7 203n/an/an/an/a6.825
GlaxoSmithKline
Assay Description
The Ki values were determined using fluorogenic substrate, 2-(aminobenzoyl)-Thr-Ile-Nle-Phe(p-NO2)-Gln-ArgNH2. A standard curve relating changes in f...
Bioorg Med Chem Lett 15: 3560-4 (2005)
Article DOI: 10.1016/j.bmcl.2005.05.101
BindingDB Entry DOI: 10.7270/Q2F769SC