BDBM91708 Sulfonamide, 8
SMILES: NS(=O)(=O)Oc1ccc2C3CCCCCC3C(=O)Oc2c1
InChI Key: InChIKey=YAMCZETVXPUYSM-UHFFFAOYSA-N
Data: 5 KI  2 IC50
Activity Spreadsheet -- Enzyme Inhibition Constant Data from BindingDB
Found 7 hits for monomerid = 91708
Trg + Lig
Ki
nM
ΔG°
kcal/mole
IC50
nM
Kd
nM
EC50/IC50
nM
koff
s-1
kon
M-1s-1
pHTemp
°C
Carbonic anhydrase 12
(Homo sapiens (Human))
BDBM91708
(Sulfonamide, 8)
Show SMILES NS(=O)(=O)Oc1ccc2C3CCCCCC3C(=O)Oc2c1
Show InChI InChI=1S/C14H17NO5S/c15-21(17,18)20-9-6-7-11-10-4-2-1-3-5-12(10)14(16)19-13(11)8-9/h6-8,10,12H,1-5H2,(H2,15,17,18)
Reactome pathway
12n/an/an/an/an/an/an/an/a
Egyptian Petroleum Research Institute
Assay Description
Inhibition assay using carbonic anhydrases.
J Enzyme Inhib Med Chem 24: 499-505 (2009)
Article DOI: 10.1080/14756360802218441
BindingDB Entry DOI: 10.7270/Q24748GC
Carbonic anhydrase 2
(Homo sapiens (Human))
BDBM91708
(Sulfonamide, 8)
Show SMILES NS(=O)(=O)Oc1ccc2C3CCCCCC3C(=O)Oc2c1
Show InChI InChI=1S/C14H17NO5S/c15-21(17,18)20-9-6-7-11-10-4-2-1-3-5-12(10)14(16)19-13(11)8-9/h6-8,10,12H,1-5H2,(H2,15,17,18)
Reactome pathway
21n/an/an/an/an/an/an/an/a
Egyptian Petroleum Research Institute
Assay Description
Inhibition assay using carbonic anhydrases.
J Enzyme Inhib Med Chem 24: 499-505 (2009)
Article DOI: 10.1080/14756360802218441
BindingDB Entry DOI: 10.7270/Q24748GC
Carbonic anhydrase
(Homo sapiens (Human))
BDBM91708
(Sulfonamide, 8)
Show SMILES NS(=O)(=O)Oc1ccc2C3CCCCCC3C(=O)Oc2c1
Show InChI InChI=1S/C14H17NO5S/c15-21(17,18)20-9-6-7-11-10-4-2-1-3-5-12(10)14(16)19-13(11)8-9/h6-8,10,12H,1-5H2,(H2,15,17,18)
Reactome pathway
23n/an/an/an/an/an/an/an/a
Universit£ di Messina
Curated by ChEMBL
Assay Description
Inhibition of human recombinant carbonic anhydrase 7 preincubated for 15 mins by stopped flow CO2 hydration assay
Eur J Med Chem 71: 105-11 (2014)
Article DOI: 10.1016/j.ejmech.2013.10.071
BindingDB Entry DOI: 10.7270/Q2348PBQ
Carbonic anhydrase 9
(Homo sapiens (Human))
BDBM91708
(Sulfonamide, 8)
Show SMILES NS(=O)(=O)Oc1ccc2C3CCCCCC3C(=O)Oc2c1
Show InChI InChI=1S/C14H17NO5S/c15-21(17,18)20-9-6-7-11-10-4-2-1-3-5-12(10)14(16)19-13(11)8-9/h6-8,10,12H,1-5H2,(H2,15,17,18)
NCI pathway
Reactome pathway
34n/an/an/an/an/an/an/an/a
Egyptian Petroleum Research Institute
Assay Description
Inhibition assay using carbonic anhydrases.
J Enzyme Inhib Med Chem 24: 499-505 (2009)
Article DOI: 10.1080/14756360802218441
BindingDB Entry DOI: 10.7270/Q24748GC
Carbonic anhydrase 1
(Homo sapiens (Human))
BDBM91708
(Sulfonamide, 8)
Show SMILES NS(=O)(=O)Oc1ccc2C3CCCCCC3C(=O)Oc2c1
Show InChI InChI=1S/C14H17NO5S/c15-21(17,18)20-9-6-7-11-10-4-2-1-3-5-12(10)14(16)19-13(11)8-9/h6-8,10,12H,1-5H2,(H2,15,17,18)
NCI pathway
Reactome pathway
3.45E+3n/an/an/an/an/an/an/an/a
Egyptian Petroleum Research Institute
Assay Description
Inhibition assay using carbonic anhydrases.
J Enzyme Inhib Med Chem 24: 499-505 (2009)
Article DOI: 10.1080/14756360802218441
BindingDB Entry DOI: 10.7270/Q24748GC
Steryl-sulfatase
(Homo sapiens (Human))
BDBM91708
(Sulfonamide, 8)
Show SMILES NS(=O)(=O)Oc1ccc2C3CCCCCC3C(=O)Oc2c1
Show InChI InChI=1S/C14H17NO5S/c15-21(17,18)20-9-6-7-11-10-4-2-1-3-5-12(10)14(16)19-13(11)8-9/h6-8,10,12H,1-5H2,(H2,15,17,18)
n/an/a 8n/an/an/an/an/an/a
University of Bath
Curated by ChEMBL
Assay Description
Inhibition of STS activity in human placental microsome
J Med Chem 58: 7634-58 (2015)
BindingDB Entry DOI: 10.7270/Q2474CP9
Carbonic anhydrase 2
(Homo sapiens (Human))
BDBM91708
(Sulfonamide, 8)
Show SMILES NS(=O)(=O)Oc1ccc2C3CCCCCC3C(=O)Oc2c1
Show InChI InChI=1S/C14H17NO5S/c15-21(17,18)20-9-6-7-11-10-4-2-1-3-5-12(10)14(16)19-13(11)8-9/h6-8,10,12H,1-5H2,(H2,15,17,18)
Reactome pathway
n/an/a 22n/an/an/an/an/an/a
University of Bath
Curated by ChEMBL
Assay Description
Inhibition of human carbonic anhydrase 2
J Med Chem 58: 7634-58 (2015)
BindingDB Entry DOI: 10.7270/Q2474CP9