BDBM9171 (3R,3aS,6aR)-hexahydrofuro[2,3-b]furan-3-yl N-[(2S,3R)-4-[(cyclopentyloxy)(4-methoxybenzene)sulfonamido]-3-hydroxy-1-phenylbutan-2-yl]carbamate::N-alkoxysulfonamide analog 11::N-alkoxysulfonamide analog entry k
SMILES: [H][C@@]12CCO[C@]1([H])OC[C@@H]2OC(=O)N[C@@H](Cc1ccccc1)[C@H](O)CN(OC1CCCC1)S(=O)(=O)c1ccc(OC)cc1
InChI Key: InChIKey=HROGQBIYFLWWNM-AJIIGFCHSA-N
Data: 1 KI  1 IC50
Activity Spreadsheet -- Enzyme Inhibition Constant Data from BindingDB
Found 1 hit for monomerid = 9171
Trg + Lig
Ki
nM
ΔG°
kcal/mole
IC50
nM
Kd
nM
EC50/IC50
nM
koff
s-1
kon
M-1s-1
pHTemp
°C
HIV-1 Protease
(Human immunodeficiency virus type 1)
BDBM9171
((3R,3aS,6aR)-hexahydrofuro[2,3-b]furan-3-yl N-[(2S...)
Show SMILES [H][C@@]12CCO[C@]1([H])OC[C@@H]2OC(=O)N[C@@H](Cc1ccccc1)[C@H](O)CN(OC1CCCC1)S(=O)(=O)c1ccc(OC)cc1 |r|
Show InChI InChI=1S/C29H38N2O9S/c1-36-21-11-13-23(14-12-21)41(34,35)31(40-22-9-5-6-10-22)18-26(32)25(17-20-7-3-2-4-8-20)30-29(33)39-27-19-38-28-24(27)15-16-37-28/h2-4,7-8,11-14,22,24-28,32H,5-6,9-10,15-19H2,1H3,(H,30,33)/t24-,25-,26+,27-,28+/m0/s1
<0.00500<-15.4 6n/an/an/an/a6.825
GlaxoSmithKline
Assay Description
The Ki values were determined using fluorogenic substrate, 2-(aminobenzoyl)-Thr-Ile-Nle-Phe(p-NO2)-Gln-ArgNH2. A standard curve relating changes in f...
Bioorg Med Chem Lett 15: 3560-4 (2005)
Article DOI: 10.1016/j.bmcl.2005.05.101
BindingDB Entry DOI: 10.7270/Q2F769SC