BDBM91783 CS262
SMILES: CC(C)COC(=O)c1ccc2NC(=O)C(=NNc3ccc(cc3)S(N)(=O)=O)c2c1
InChI Key: InChIKey=JQMQQPJLUPJHES-UHFFFAOYSA-N
Data: 2 Kd
PDB links: 1 PDB ID matches this monomer.
Activity Spreadsheet -- Enzyme Inhibition Constant Data from BindingDB
Found 2 hits for monomerid = 91783
Trg + Lig
Ki
nM
ΔG°
kcal/mole
IC50
nM
Kd
nM
EC50/IC50
nM
koff
s-1
kon
M-1s-1
pHTemp
°C
Cyclin-dependent kinase 2
(Homo sapiens (Human))
BDBM91783
(CS262)
Show SMILES CC(C)COC(=O)c1ccc2NC(=O)C(=NNc3ccc(cc3)S(N)(=O)=O)c2c1 |w:15.15|
Show InChI InChI=1S/C19H20N4O5S/c1-11(2)10-28-19(25)12-3-8-16-15(9-12)17(18(24)21-16)23-22-13-4-6-14(7-5-13)29(20,26)27/h3-9,11,22H,10H2,1-2H3,(H2,20,26,27)(H,21,23,24)
NCI pathway
Reactome pathway
n/an/an/a 47n/an/an/a7.525
CSAR
Assay Description
OctetRed
CSAR 1: (2012)
Cyclin-dependent kinase 2
(Homo sapiens (Human))
BDBM91783
(CS262)
Show SMILES CC(C)COC(=O)c1ccc2NC(=O)C(=NNc3ccc(cc3)S(N)(=O)=O)c2c1 |w:15.15|
Show InChI InChI=1S/C19H20N4O5S/c1-11(2)10-28-19(25)12-3-8-16-15(9-12)17(18(24)21-16)23-22-13-4-6-14(7-5-13)29(20,26)27/h3-9,11,22H,10H2,1-2H3,(H2,20,26,27)(H,21,23,24)
NCI pathway
Reactome pathway
n/an/an/a 88n/an/an/a7.525
CSAR
Assay Description
Thermofluor
CSAR 1: (2012)