BDBM92338 Wyq16#
SMILES: CCCc1nn(C)c2c1nc([nH]c2=O)-c1cc(ccc1OCC)S(=O)(=O)NC(=O)OC(C)C
InChI Key: InChIKey=RGTRFWTZGHUUBF-UHFFFAOYSA-N
Data: 4 IC50
PDB links: 1 PDB ID matches this monomer.
Activity Spreadsheet -- Enzyme Inhibition Constant Data from BindingDB
Found 4 hits for monomerid = 92338
Trg + Lig
Ki
nM
ΔG°
kcal/mole
IC50
nM
Kd
nM
EC50/IC50
nM
koff
s-1
kon
M-1s-1
pHTemp
°C
Phosphodiesterase (TcrPDEC)
(Trypanosoma cruzi)
BDBM92338
(Wyq16#)
Show SMILES CCCc1nn(C)c2c1nc([nH]c2=O)-c1cc(ccc1OCC)S(=O)(=O)NC(=O)OC(C)C
Show InChI InChI=1S/C21H27N5O6S/c1-6-8-15-17-18(26(5)24-15)20(27)23-19(22-17)14-11-13(9-10-16(14)31-7-2)33(29,30)25-21(28)32-12(3)4/h9-12H,6-8H2,1-5H3,(H,25,28)(H,22,23,27)
n/an/a 230n/an/an/an/a7.524
University of North Carolina
Assay Description
Enzymatic activities were assayed using [3H] cAMP and [3H]cGMP as substrate.
J Biol Chem 287: 11788-97 (2012)
Article DOI: 10.1074/jbc.M111.326777
BindingDB Entry DOI: 10.7270/Q2K9364D
3D
3D Structure (crystal)
Phosphodiesterase
(Trypanosoma cruzi)
BDBM92338
(Wyq16#)
Show SMILES CCCc1nn(C)c2c1nc([nH]c2=O)-c1cc(ccc1OCC)S(=O)(=O)NC(=O)OC(C)C
Show InChI InChI=1S/C21H27N5O6S/c1-6-8-15-17-18(26(5)24-15)20(27)23-19(22-17)14-11-13(9-10-16(14)31-7-2)33(29,30)25-21(28)32-12(3)4/h9-12H,6-8H2,1-5H3,(H,25,28)(H,22,23,27)
n/an/a 230n/an/an/an/an/an/a
Vrije Universiteit Amsterdam
Curated by ChEMBL
Assay Description
Inhibition of N-terminal His6-tagged Trypanosoma cruzi 427 PDEC catalytic domain (270 to 614 residues) expressed in Escherichia coli BL21-CodonPlus c...
J Med Chem 59: 7029-65 (2016)
Article DOI: 10.1021/acs.jmedchem.5b01813
Phosphodiesterase
(Trypanosoma cruzi)
BDBM92338
(Wyq16#)
Show SMILES CCCc1nn(C)c2c1nc([nH]c2=O)-c1cc(ccc1OCC)S(=O)(=O)NC(=O)OC(C)C
Show InChI InChI=1S/C21H27N5O6S/c1-6-8-15-17-18(26(5)24-15)20(27)23-19(22-17)14-11-13(9-10-16(14)31-7-2)33(29,30)25-21(28)32-12(3)4/h9-12H,6-8H2,1-5H3,(H,25,28)(H,22,23,27)
n/an/a 230n/an/an/an/an/an/a
Vrije Universiteit Amsterdam
Curated by ChEMBL
Assay Description
Inhibition of N-terminal His6-tagged Trypanosoma cruzi 427 PDEC catalytic domain (270 to 614 residues) expressed in Escherichia coli BL21-CodonPlus c...
J Med Chem 59: 7029-65 (2016)
Article DOI: 10.1021/acs.jmedchem.5b01813
cGMP-specific 3',5'-cyclic phosphodiesterase
(Homo sapiens (Human))
BDBM92338
(Wyq16#)
Show SMILES CCCc1nn(C)c2c1nc([nH]c2=O)-c1cc(ccc1OCC)S(=O)(=O)NC(=O)OC(C)C
Show InChI InChI=1S/C21H27N5O6S/c1-6-8-15-17-18(26(5)24-15)20(27)23-19(22-17)14-11-13(9-10-16(14)31-7-2)33(29,30)25-21(28)32-12(3)4/h9-12H,6-8H2,1-5H3,(H,25,28)(H,22,23,27)
Reactome pathway
n/an/a 3n/an/an/an/a7.524
University of North Carolina
Assay Description
Enzymatic activities were assayed using [3H] cAMP and [3H]cGMP as substrate.
J Biol Chem 287: 11788-97 (2012)
Article DOI: 10.1074/jbc.M111.326777
BindingDB Entry DOI: 10.7270/Q2K9364D