BDBM92363 GPESB02
SMILES: CO[C@@H]1O[C@H](Cn2cc(nn2)C2=CCCCC2)[C@@H]2OC(C)(C)OC12
InChI Key: InChIKey=YIRMGPVZOMKBPA-VFSICIBPSA-N
Data: 1 KI  1 IC50
Activity Spreadsheet -- Enzyme Inhibition Constant Data from BindingDB
Found 1 hit for monomerid = 92363
Trg + Lig
Ki
nM
ΔG°
kcal/mole
IC50
nM
Kd
nM
EC50/IC50
nM
koff
s-1
kon
M-1s-1
pHTemp
°C
Pancreatic alpha-amylase
(Sus scrofa (Pig))
BDBM92363
(GPESB02)
Show SMILES CO[C@@H]1O[C@H](Cn2cc(nn2)C2=CCCCC2)[C@@H]2OC(C)(C)OC12 |r,t:12|
Show InChI InChI=1S/C17H25N3O4/c1-17(2)23-14-13(22-16(21-3)15(14)24-17)10-20-9-12(18-19-20)11-7-5-4-6-8-11/h7,9,13-16H,4-6,8,10H2,1-3H3/t13-,14+,15?,16-/m1/s1
3.42E+5 -4.92 1.50E+5n/an/an/an/a7.037
Yonsei University
Assay Description
To test whether GCTs share a common binding pocket on PPA with acarbose, we performed an experiment according to the method of Yonetani and Theorell.
Chembiochem 13: 1584-93 (2012)
Article DOI: 10.1002/cbic.201200272
BindingDB Entry DOI: 10.7270/Q2ST7NFC