BDBM92365 GPESB11
SMILES: CO[C@@H]1O[C@H](Cn2cc(COC(C)=O)nn2)[C@@H]2OC(C)(C)OC12
InChI Key: InChIKey=AUXGHWGLINFNKA-ZGVCCVRISA-N
Data: 1 KI  1 IC50
Activity Spreadsheet -- Enzyme Inhibition Constant Data from BindingDB
Found 1 hit for monomerid = 92365
Trg + Lig
Ki
nM
ΔG°
kcal/mole
IC50
nM
Kd
nM
EC50/IC50
nM
koff
s-1
kon
M-1s-1
pHTemp
°C
Pancreatic alpha-amylase
(Sus scrofa (Pig))
BDBM92365
(GPESB11)
Show SMILES CO[C@@H]1O[C@H](Cn2cc(COC(C)=O)nn2)[C@@H]2OC(C)(C)OC12 |r|
Show InChI InChI=1S/C14H21N3O6/c1-8(18)20-7-9-5-17(16-15-9)6-10-11-12(13(19-4)21-10)23-14(2,3)22-11/h5,10-13H,6-7H2,1-4H3/t10-,11+,12?,13-/m1/s1
2.34E+5 -5.15 1.25E+5n/an/an/an/a7.037
Yonsei University
Assay Description
To test whether GCTs share a common binding pocket on PPA with acarbose, we performed an experiment according to the method of Yonetani and Theorell.
Chembiochem 13: 1584-93 (2012)
Article DOI: 10.1002/cbic.201200272
BindingDB Entry DOI: 10.7270/Q2ST7NFC